*HEADING
Import X2S - XPL job
 Marlow, compressible, uniaxial
*preprint,model=yes,history=yes
*restart,write,num=20
*NODE,NSET=one
*NSET,NSET=FACE1
*NSET,NSET=FACE2
*NSET,NSET=FACE3
*NSET,NSET=FACE4
*NSET,NSET=FACE5
*NSET,NSET=FACE6
*nset,nset=noutu
*ELEMENT,TYPE=C3D8r,ELSET=ONE
*orientation,name=ori1
*SOLID SECTION,ELSET=ONE,MATERIAL=mat_mars
**,ori=ori1
*MATERIAL,NAME=mat_mars
*DENSITY
1.e-6
*HYPERELASTIC,marlow,poisson=0.475
*include, input=heplmu_matprops_uni.inp
*amplitude,name=nominal_strain,definition=smoothstep
0.0,0.0, .01,1.0, .02,0.05
*STEP,nlgeom=yes
*dynamic, explicit
,.02
*BOUNDARY
FACE1,3
FACE3,2
FACE6,1
*boundary, amplitude=nominal_strain
face4,1,1,1.0
*output,history,freq=1
*node output,nset=noutu
u1
rf1
*element output,elset=one
dmener,eldmd
*output,field
*node output,nset=one
u,rf
*element output,elset=one
s,le,pe,peeq,ener
*END STEP