*HEADING
 Test import capability with FeFp: Explicit to Standard
 Element:  CPS4R + orientation
 Material: marlow + plasticity + mullins
 Base for file: xs_s_fefp2d_biori.inp
*RESTART,WRITE,num=20
*NODE,NSET=ALL
*NSET,NSET=y0
*NSET,NSET=y1
*NSET,NSET=x0
*NSET,NSET=x1
**
*ELEMENT,TYPE=CPS4R,ELSET=Solid
*ELSET,ELSET=EALL
 SOLID
*orientation, name=ori1
*solid section, elset=solid, material=mat-129, ori=ori1
 1.
**---------------------------------------------
*MATERIAL,NAME=mat-129
*DENSITY
1.e-6
*HYPERELASTIC,marlow,poisson=0.495
**
** Output: uniaxial loading
**
*uniaxial Test Data
*Mullins effect, Test Data Input
**
** Output: uniaxial mullins
**
*uniaxial Test Data
*uniaxial Test Data
**
** Output: Hardening data
**
*Plastic
0.19668078,  0
2.9532671, 0.012512393
9.5576679, 0.044332625
92.370193, 0.44332625
**---------------------------------------------
*amplitude,name=nominal_strain
0.0, 0.0, 0.5, 1.0, 1.0, 0.05
*STEP,nlgeom=yes
*DYNAMIC,EXPLICIT
 ,1.
*BOUNDARY
 y0,2,2
 x0,1,1
*boundary, amplitude=nominal_strain
 x1,1,1,0.4
 y1,2,2,0.2
*output,field
*node output
 u,
 RF
*element output
 S
 PEEQ
 E
*output,history,time interval=0.01
*element output,elset=solid
 s11,
 s22,
 LE11
*END STEP
**