*HEADING
 XRVDA4S2: TWO CONCENTRIC CYLINDERS OF INFINITE LENGTH
 TEMPERATURES IN CELCIUS.
*NODE
*NGEN,NSET=CENT
*NGEN,NSET=OUT
*NGEN
*ELEMENT,TYPE=DCAX4,ELSET=EALL
*ELGEN,ELSET=INNER
*ELGEN,ELSET=OUTER
*ELSET,ELSET=EALL
INNER,OUTER,
*SOLID SECTION,ELSET=EALL,MATERIAL=ALU
*MATERIAL,NAME=ALU
*CONDUCTIVITY
237.,
*DENSITY
2702.,
*SPECIFIC HEAT
903.,
*surface,NAME=SURF1,PROPERTY=PROP1
INNER,S2
OUTER,S4
*CAVITY DEFINITION,NAME=CAV1,AMB=-173.16
SURF1,
*SURFACE PROPERTY,NAME=PROP1
*EMISSIVITY
*PHYSICAL CONSTANTS,STEFANB=5.67E-08,ABSOLUTE ZERO=-273.16
**
*RESTART,WRITE,FREQ=10
*STEP,INC=20
 RADIATION VIEWFACTOR TESTS
*HEAT TRANSFER,STEADY STATE
1.,1.
*RADIATION VIEWFACTOR,SYMMETRY=SYMM1
*RADIATION SYMMETRY,NAME=SYMM1
*PERIODIC,TYPE=ZDIR,NR=10
*BOUNDARY
CENT,11,,726.84
OUT,11,,-173.16
*NODE PRINT
NT,COORD
*NODE FILE
NT,
*OUTPUT,FIELD
*NODE OUTPUT
NT,
*RADIATION PRINT
RADFL,RADFLA,RADTL,RADTLA,VFTOT,FTEMP
*RADIATION FILE
RADFL,RADFLA,RADTL,RADTLA,VFTOT,FTEMP
*OUTPUT,FIELD
*RADIATION OUTPUT
RADFL,RADFLA,RADTL,RADTLA,VFTOT,FTEMP
*END STEP