*HEADING
 BASIC VERIFICATION - UNIVERSAL MPC TYPE
 ELEMENT: B33H, TEST TYPE:5 ,TEST NUMBER:6  --  MPCUNIVERSAL
*NODE
*NSET, NSET=ONE
*NSET, NSET=TWO
*NSET, NSET=FOUR
*ELEMENT,TYPE=B33H,ELSET=A
*TRANSFORM, NSET=ONE
** 45 ABOUT Z AXIS, THEN 45 ABOUT (TRANSF) X AXIS
*TRANSFORM, NSET=TWO
** 30 ABOUT Y AXIS, THEN 60 ABOUT (TRANSF.) Z AXIS
*TRANSFORM, NSET=FOUR
** 30 ABOUT Y AXIS, THEN 45 ABOUT (TRANSF.) X AXIS
*MPC
PIN,1,2
UNIVERSAL,2,1,3,4
*BEAM SECTION,SECT=CIRC,MATERIAL=MAT,ELSET=A
0.1,
*MATERIAL,NAME=MAT
*ELASTIC
200.0E9,0.0
*BOUNDARY
3,6,6
4,6,6
10,1,6
*STEP, UNSYMM=YES
 PULL ON THE JOINT
*STATIC
1.0,1.0
*CLOAD,FOLLOWER
20,1,1.0E6
*MONITOR,NODE=20,DOF=2
*EL PRINT,FREQ=9999
SF,
*NODE PRINT,FREQ=9999, GLO=YES
U,COORD
RF,
*EL FILE,FREQ=9999
SF,
*NODE FILE,FREQ=9999
U,COORD
*END STEP
*STEP,NLGEOM,INC=20, UNSYMM=YES
  TWIST THE 3-4 JOINT 45 DEGREES
*STATIC
0.25,1.0
*BOUNDARY
3,6,6, 0.785398164
*END STEP
*STEP,NLGEOM,INC=20, UNSYMM=YES
  TWIST THE 3-5 JOINT 45 DEGREES
*STATIC
0.25,1.0
*BOUNDARY
4,6,6,-0.785398164
*END STEP