*HEADING
 BASIC VERIFICATION - MPC TYPE QUADRATIC with *TRANSFORM
 ELEMENT: CPS8 , TEST TYPE:5 ,TEST NUMBER:6  --
*NODE
*NGEN,NSET=LEFT
*NGEN
*NSET,NSET=BOTTOM
*ELEMENT,TYPE=CPS8,ELSET=ELALL
*SOLID SECTION,ELSET=ELALL,MATERIAL=MAT
*MATERIAL,NAME=MAT
*ELASTIC
 3E6,.3
*NSET,NSET=MPC_N1
*NSET,NSET=MPC_N2
*NSET,NSET=INDP_N
*TRANSFORM, NSET=MPC_N1
*TRANSFORM, NSET=MPC_N2
*TRANSFORM,NSET=INDP_N
*BOUNDARY
LEFT,1
BOTTOM,2
*MPC
QUADRATIC,201,103,108,113
QUADRATIC,203,103,108,113
*STEP,PERTURBATION
*STATIC
*BOUNDARY
LEFT,1
BOTTOM,2
*DLOAD
12,P3,10000.
13,P3,10000.
*EL FILE
 S,
*NODE FILE
 U,
*EL PRINT
 S,
*NODE PRINT,GLO=YES
 U,
*END STEP
*STEP,NLGEOM
*STATIC
.5,1.
*BOUNDARY
LEFT,1
BOTTOM,2
*DLOAD
12,P3,10000.
13,P3,10000.
*EL FILE,FREQ=99
 S,
*NODE FILE,FREQ=99
 U,
*EL PRINT,FREQ=99
 S,
*NODE PRINT,FREQ=99,GLO=YES
 U,
*END STEP