*HEADING
*PREPRINT,MODEL=YES,HISTORY=YES,ECHO=YES
*PART, NAME=SOLID
*NODE, NSET=FRONT
*NCOPY, CHANGE NUMBER=100, OLD SET=FRONT, NEW SET=FRONT1,SHIFT
*NCOPY, CHANGE NUMBER=200, OLD SET=FRONT, NEW SET=FRONT2,SHIFT
*NCOPY, CHANGE NUMBER=300, OLD SET=FRONT, NEW SET=FRONT3,SHIFT
*NCOPY, CHANGE NUMBER=400, OLD SET=FRONT, NEW SET=FRONT4,SHIFT
*NSET, NSET=NSOLID, UNSORTED
FRONT2,FRONT1,FRONT,FRONT3,FRONT4
*NSET, NSET=BOT,GEN
*ELEMENT, TYPE=C3D8R, ELSET=ESOLID
*ELGEN, ELSET=ESOLID
*SOLID SECTION, MATERIAL=ELASTIC, ELSET=ESOLID
*END PART
*PART, NAME=SHELL
*NODE
*NGEN, NSET=A
*NGEN, NSET=B
*NFILL, NSET=NSHELL
A,B,10,11
*NSET, NSET=PULL,GEN
*ELEMENT, TYPE=S3R
*ELGEN, ELSET=ESHELL
*SHELL SECTION, MATERIAL=ELASTIC, ELSET=ESHELL
.5,
*END PART
*ASSEMBLY, NAME=ASSEMBLY
*INSTANCE, NAME=SOLID_A, PART=SOLID
*END INSTANCE
*INSTANCE, NAME=SHELL_A, PART=SHELL
*END INSTANCE
*SURFACE, NAME=SOLSURF
SOLID_A.ESOLID,
*SURFACE, NAME=SHELLSURF
SHELL_A.ESHELL,
*NSET, NSET=NREF, INTERNAL, INSTANCE=SHELL_A
*FASTENER, PROPERTY=SPOTPROP, INTERACTION NAME=SPOTTEST, REFERENCE NODE SET=NREF
ASSEMBLY_SHELLSURF,ASSEMBLY_SOLSURF
*FASTENER PROPERTY, NAME=SPOTPROP
*END ASSEMBLY
*MATERIAL, NAME=ELASTIC
*ELASTIC
 30.0e6,0.3
*DENSITY
1.0,
*NSET, NSET=QA_TEST_ALLNODES
ASSEMBLY.SOLID_A.NSOLID, ASSEMBLY.SHELL_A.NSHELL
*ELSET, ELSET=QA_TEST_ALLELEMS
ASSEMBLY.SOLID_A.ESOLID, ASSEMBLY.SHELL_A.ESHELL
*BOUNDARY
ASSEMBLY.SOLID_A.BOT,1,3,0.0
*AMPLITUDE, NAME=AMP,DEFINITION=SMOOTH STEP
0.0,0.0,.5,1.0,1.0,1.0
*STEP
 Apply uniform load
*DYNAMIC, EXPLICIT
,1.
*BOUNDARY,AMPLITUDE=AMP
ASSEMBLY.SHELL_A.PULL,2,2,1.E-1
*OUTPUT, FIELD, NUMBER=1
*NODE OUTPUT,NSET=QA_TEST_ALLNODES
 U,
***ELEMENT OUTPUT,ELSET=QA_TEST_ALLELEMS
***S,
***OUTPUT, HISTORY, FREQ=1
***NODE OUTPUT, NSET=QA_TEST_OUTNODES
***U,RF
*END STEP