*HEADING
*PREPRINT, MODEL=YES
*PART, NAME=SOLID
*NODE, NSET=NSOLID
*ELEMENT, TYPE=C3D4, ELSET=ESOLID
*SOLID SECTION, ELSET=ESOLID, MATERIAL=MATERIAL-1
*END PART
*PART, NAME=RIGID
*NODE
*NGEN, NSET=A
*NGEN, NSET=B
*NFILL, NSET=NRIGID
A,B,10,11
*NSET, NSET=PULL, GEN
*NSET, NSET=RIGREF
*ELEMENT, TYPE=R3D4
*ELGEN, ELSET= ERIGID
*RIGID BODY, ELSET=ERIGID, REF NODE=10000
*END PART
*ASSEMBLY, NAME=ASSEMBLY
*INSTANCE, NAME=SOLID_A, PART=SOLID
*END INSTANCE
*INSTANCE, NAME=RIGID_A, PART=RIGID
*END INSTANCE
*NSET, NSET=G4, INTERNAL, INSTANCE=SOLID_A
*SURFACE, TYPE=ELEMENT, NAME=SOLSURF
SOLID_A.ESOLID,
*SURFACE, TYPE=ELEMENT, NAME=RIGSURF
RIGID_A.ERIGID,
*NSET, NSET=NREF, INTERNAL, INSTANCE=RIGID_A
*FASTENER, PROPERTY=SPOTPROP, INTERACTION NAME=SPOTTEST, REFERENCE NODE SET=NREF
ASSEMBLY_RIGSURF,ASSEMBLY_SOLSURF
*FASTENER PROPERTY, NAME=SPOTPROP
*END ASSEMBLY
*MATERIAL, NAME=MATERIAL-1
*ELASTIC
 3E+06, 0.3
*DENSITY
1.0,
*NSET, NSET=QA_TEST_ALLNODES
ASSEMBLY.SOLID_A.NSOLID, ASSEMBLY.RIGID_A.NRIGID
*ELSET, ELSET=QA_TEST_ALLELEMS
ASSEMBLY.SOLID_A.ESOLID,ASSEMBLY.RIGID_A.ERIGID
*AMPLITUDE, NAME=AMP,DEFINITION=SMOOTH STEP
0.0,0.0,.5,1.0,1.0,1.0
*STEP, NAME=STEP-1
UNIFORM LOAD
*DYNAMIC, EXPLICIT
,1.
*BOUNDARY,AMPLITUDE=AMP
ASSEMBLY.RIGID_A.RIGREF,1,1,0.0
ASSEMBLY.RIGID_A.RIGREF,2,2,1.E-1
ASSEMBLY.RIGID_A.RIGREF,3,6,0.0
*BOUNDARY
G4, 1, 1
G4, 2, 2
G4, 3, 3
*OUTPUT, FIELD, NUMBER=1
*NODE OUTPUT,NSET=QA_TEST_ALLNODES
 U,
***ELEMENT OUTPUT,ELSET=QA_TEST_ALLELEMS
***S,
***OUTPUT, HISTORY, FREQ=1
****NODE OUTPUT, NSET=QA_TEST_OUTNODES
***RF,
*END STEP