*HEADING
*PREPRINT, MODEL=YES
*PART, NAME=SOLID
*NODE, NSET=NSOLID
*ELEMENT, TYPE=C3D10M, ELSET=ESOLID
*SOLID SECTION, ELSET=ESOLID, MATERIAL=MATERIAL-1
*END PART
*PART, NAME=MEMBRANE
*NODE
*NGEN, NSET=A
*NGEN, NSET=B
*NFILL, NSET=NMEMBRANE
A,B,10,11
*NSET, NSET=PULL, GEN
*ELEMENT, TYPE = M3D4R
*ELGEN, ELSET= EMEMBRANE
*MEMBRANE SECTION, ELSET=EMEMBRANE, MATERIAL=MATERIAL-2
.5,
*END PART
*ASSEMBLY, NAME=ASSEMBLY
*INSTANCE, NAME=SOLID_A, PART=SOLID
*END INSTANCE
*INSTANCE, NAME=MEMBRANE_A, PART=MEMBRANE
*END INSTANCE
*NSET, NSET=G4, INTERNAL, INSTANCE=SOLID_A
*SURFACE, TYPE=ELEMENT, NAME=SOLSURF
SOLID_A.ESOLID,
*SURFACE, TYPE=ELEMENT, NAME=MEMSURF
MEMBRANE_A.EMEMBRANE,
*NSET, NSET=NREF, INTERNAL, INSTANCE=MEMBRANE_A
*FASTENER, PROPERTY=SPOTPROP, INTERACTION NAME=SPOTTEST, REFERENCE NODE SET=NREF
ASSEMBLY_MEMSURF,ASSEMBLY_SOLSURF
*FASTENER PROPERTY, NAME=SPOTPROP
*END ASSEMBLY
*MATERIAL, NAME=MATERIAL-2
*ELASTIC
 3E+06, 0.3
*DENSITY
1.0,
*MATERIAL, NAME=MATERIAL-1
*ELASTIC
 3E+06, 0.3
*DENSITY
1.0,
*NSET, NSET=QA_TEST_ALLNODES
ASSEMBLY.SOLID_A.NSOLID, ASSEMBLY.MEMBRANE_A.NMEMBRANE
*ELSET, ELSET=QA_TEST_ALLELEMS
ASSEMBLY.SOLID_A.ESOLID, ASSEMBLY.MEMBRANE_A.EMEMBRANE
*AMPLITUDE, NAME=AMP,DEFINITION=SMOOTH STEP
0.0,0.0,.5,1.0,1.0,1.0
*STEP, NAME=STEP-1
UNIFORM LOAD
*DYNAMIC, EXPLICIT
,1.
*BOUNDARY,AMPLITUDE=AMP
ASSEMBLY.MEMBRANE_A.PULL,2,2,1.E-1
*BOUNDARY
G4, 1, 1
G4, 2, 2
G4, 3, 3
*OUTPUT, FIELD, NUMBER=1
*NODE OUTPUT,NSET=QA_TEST_ALLNODES
 U,
***ELEMENT OUTPUT,ELSET=QA_TEST_ALLELEMS
***S,
***OUTPUT, HISTORY, FREQ=1
****NODE OUTPUT, NSET=QA_TEST_OUTNODES
***RF,
*END STEP