*HEADING
 BASIC VERIFICATION - BOUNDARY CONDITIONS - COMPLEX
 ELEMENT: CPS4 INPUT DECK: .INP
*AMPLITUDE,NAME=CONST
0,1.11,1,1.11
*NODE
*NGEN,NSET=NALL
*ELEMENT,TYPE=CPS4,ELSET=EALL
*ELGEN,ELSET=EALL
*MATERIAL,NAME=SOLID
*DENSITY
7.0335E-6,
*ELASTIC
0.7734,.25
*SOLID SECTION,MATERIAL=SOLID,ELSET=EALL
*NSET,NSET=DRIV
*STEP
*STEADY STATE DYNAMICS,DIRECT
50,
100,
*LOAD CASE,NAME="REAL"
*BOUNDARY
DRIV,2,,1.11
*END LOAD CASE
*LOAD CASE,NAME="COMPLEX"
*BOUNDARY,LOADCASE=2
DRIV,2,,1.11
*END LOAD CASE
*LOAD CASE,NAME="REAL-COMPLEX"
*BOUNDARY
DRIV,2,,1.11
*BOUNDARY,LOADCASE=2
DRIV,2,,1.11
*END LOAD CASE
*END STEP