*HEADING
FeFp: c3d8, biaxial tension
Marlow model, mullins effect
*NODE,NSET=one
*NSET,NSET=FACE1
*NSET,NSET=FACE2
*NSET,NSET=FACE3
*NSET,NSET=FACE4
*NSET,NSET=FACE5
*NSET,NSET=FACE6
*nset,nset=noutu
*nset,nset=noutf
*ELEMENT,TYPE=C3D8,ELSET=ONE
*SOLID SECTION,ELSET=ONE,MATERIAL=mat-129
*MATERIAL,NAME=mat-129
*DENSITY
1.e-6
*HYPERELASTIC,marlow,poisson=0.475
*include, input=heplmu_matprops_bi.inp
*amplitude,name=nominal_stress
0.0,0.0, 0.1,2.44444, 0.2,0.0, 0.4,3.959985,
0.6,0.0, 0.9,6.21102
*STEP
*dynamic, explicit
 ,0.9
*BOUNDARY
FACE1,3
FACE3,2
FACE6,1
*cload, amplitude=nominal_stress
face4,1,0.25
face2,3,0.25
*output,history,freq=1
*node output,nset=noutu
u1
*node output,nset=noutf
rf1
*output,field
*node output
u
*element output
s
*END STEP