*Heading
** Job name: wicking_c3d4p_deform Model name: Model-1
** Generated by: Abaqus/CAE 6.10-EFR
*Preprint, echo=NO, model=NO, history=NO, contact=NO
**
** PARTS
**
*Part, name=Part-1
*End Part
**
**
** ASSEMBLY
**
*Assembly, name=Assembly
**
*Instance, name=Part-1-1, part=Part-1
*Node
*Element, type=C3D4P
*Nset, nset=_PickedSet2, internal, generate
*Elset, elset=_PickedSet2, internal, generate
** Section: Section-1
*Solid Section, elset=_PickedSet2, material=Material-1
*End Instance
**
*Nset, nset=Bottom, instance=Part-1-1
*Elset, elset=Bottom, instance=Part-1-1
*Nset, nset=Nall, instance=Part-1-1, generate
*Elset, elset=Nall, instance=Part-1-1, generate
*Nset, nset=Block, instance=Part-1-1, generate
*Elset, elset=Block, instance=Part-1-1, generate
*Nset, nset=Bottom_PP_, internal, instance=Part-1-1
*End Assembly
**
** MATERIALS
**
*Material, name=Material-1
*Density
 0.1,
*Elastic
50.,0.
*Permeability, specific=10.
 0.00037,0.
*Porous Bulk Moduli
*Sorption
*Sorption, type=Exsorption
*Initial Conditions, type=Saturation
 Nall, .05
*Initial Conditions, type=Pore pressure
 Nall, -22.0, 1.0, -12.0, 0.0
*Initial Conditions, type=Ratio
 Nall, 5.
*Initial Conditions, type=stress, geostatic
 Block, -1.1,1.,-2.016666667,0.,0.,0.
*Boundary
 Nall, 1,2
 Bottom_PP_, 3,3
** ----------------------------------------------------------------
**
** STEP: Step-1
**
*Step, name=Step-1
Geostatic Loading
*Geostatic
1e-06, 1e-06, 1e-11, 1e-06
**
** LOADS
**
** Name: Load-1   Type: Gravity
*Dload
, GRAV, 10., 0., 0., -1.
*Boundary
 Bottom_PP_, 8,8,-12.
**
** OUTPUT REQUESTS
**
*Restart, write, frequency=0
**
** FIELD OUTPUT: F-Output-1
**
*Output, field, frequency=10
*Node Output
POR, U
*Element Output, directions=YES
S, SAT
**
** HISTORY OUTPUT: H-Output-1
**
*Output, history, variable=PRESELECT
*End Step
** ----------------------------------------------------------------
**
** STEP: Step-2
**
*Step, name=Step-2
Consolidation
*Soils, consolidation, end=PERIOD, utol=20.
*Boundary
 Bottom_PP_, 8,8,0.
*CONTROLS,ANALYSIS=DISCONTINUOUS
*CONTROLS,PARAMETERS=FIELD,FIELD=DISPLACEMENT
,1.,
*CONTROLS,PARAMETERS=FIELD,FIELD=PORE FLUID PRESSURE
,1.,
**
** OUTPUT REQUESTS
**
*Restart, write, frequency=0
**
** FIELD OUTPUT: F-Output-1
**
*Output, field, frequency=10
*Node Output
POR, U
*Element Output, directions=YES
S, SAT
**
** HISTORY OUTPUT: H-Output-1
**
*Output, history, variable=PRESELECT
*End Step