*HEADING
 TRANSIENT THERMAL LOADING OF VISCOELASTIC SLAB - EXPLICIT [CPE3T]
 LARGE STRAIN ELASTIC BEHAVIOR
**
** See ch. 3.1.2 of ABAQUS/Benchmarks Manual
**
*NODE
*NGEN,NSET=BOT
*NGEN,NSET=TOP
*NGEN,NSET=MID
*NFILL,NSET=NALL
BOT,TOP,2,100
*NSET,NSET=NALL
NALL,MID
*NSET,NSET=RIGHT
*NSET,NSET=LEFT
*NSET,NSET=QA_TEST,GEN
*NSET,NSET=NOUT
QA_TEST,
*ELEMENT,TYPE=CPE3T,ELSET=SOLID
*ELGEN,ELSET=SOLID
*SOLID SECTION,ELSET=SOLID,MATERIAL=MAT1
*MATERIAL,NAME=MAT1
*HYPERELASTIC,N=1,MODULI=INSTANTANEOUS
3333.33,-1666.67,.00002
*VISCOELASTIC,TIME=PRONY
0.901001,0.0,0.99
*TRS
*EXPANSION
1.E-5,
*CONDUCTIVITY
1.0,
*DENSITY
1.0       ,
*SPECIFIC HEAT
1.0,
*BOUNDARY
BOT,2
TOP,2
LEFT,1
*INITIAL CONDITIONS,TYPE=TEMPERATURE
NALL, 0.0
*STEP
*DYNAMIC TEMPERATURE-DISPLACEMENT, EXPLICIT
*BOUNDARY
RIGHT,11,,100.
************************************
*FILE OUTPUT, NUM=4
*NODE FILE, NSET=NOUT
NT,U
***********************************
*OUTPUT,FIELD,NUMBER INTERVAL=4
*NODE OUTPUT, NSET=QA_TEST
NT,U
*NODE OUTPUT, NSET=NALL
NT,U
*ELEMENT OUTPUT, ELSET=SOLID
S,LE
***********************************
***OUTPUT, HISTORY,FREQUENCY=1000
***ELEMENT OUTPUT, ELSET=SOLID
**S22,
*********
*OUTPUT, HISTORY,TIME INTERVAL=1.250
*ENERGY OUTPUT,VAR=ALL
***********************************
*END STEP