*HEADING
 HEAT TRANSFER ANALYSIS OF INFINITE SLAB -- DC2D8
*NODE
*NGEN,NSET=BOT
*NGEN,NSET=TOP
*NFILL
BOT,TOP,2,100
*NSET,NSET=RIGHT
*ELEMENT,TYPE=DC2D8,ELSET=SOLID
*ELGEN,ELSET=SOLID
*SOLID SECTION,ELSET=SOLID,MATERIAL=MAT1
*MATERIAL,NAME=MAT1
*CONDUCTIVITY
1.0,
*DENSITY
1.0       ,
*SPECIFIC HEAT
1.0,
*RESTART,WRITE
*STEP,INC=50
*HEAT TRANSFER,DELTMX=20.,END=PERIOD
5.E-4,1.0
*BOUNDARY
RIGHT,11,,100.
*NODE FILE
NT,
*OUTPUT,FIELD
*NODE OUTPUT
NT,
*NODE PRINT,FREQUENCY=1
NT,
*EL PRINT,FREQUENCY=0
*FILE FORMAT,ZERO INCREMENT,ASCII
*END STEP
*STEP,INC=50
*HEAT TRANSFER,DELTMX=20.,END=PERIOD
.2,5.0
*END STEP