*HEADING
 TRANSIENT INTERNAL PRESSURE ON VISCOEL. CYLINDER -- CAX8R
 VISCOELASTIC MATERIAL IN ELASTIC CASE
 INTERNAL PRESSURE THAT IS FUNCTION OF TIME
 UNITS: SI
*RESTART,WRITE
*NODE,NSET=INNER
*NODE,NSET=OUTER
*NODE,NSET=CASE
*NFILL,NSET=CYLINDER,BIAS=0.9,TWO STEP
INNER,OUTER,40,10
*NFILL,NSET=CASE
OUTER,CASE,2,10
*NSET,NSET=ALL
CYLINDER,CASE
*ELEMENT,TYPE=CAX8R
*ELGEN,ELSET=CYLINDER
*ELEMENT,TYPE=CAX8R,ELSET=CASE
*ELSET,ELSET=ELPRINT
*SOLID SECTION,ELSET=CYLINDER,MATERIAL=VISCO
*SOLID SECTION,ELSET=CASE,MATERIAL=ELASTIC
*MATERIAL,NAME=ELASTIC
*ELASTIC,TYPE=ISOTROPIC
 200000, 3.00E-01
*MATERIAL,NAME=VISCO
*ELASTIC,MODULI=INSTANTANEOUS
 1651.59, 0.4999
*VISCOELASTIC,TIME=PRONY
 0.1986, ,0.281E-7
 0.1828, ,0.281E-5
 0.1388, ,0.281E-3
 0.2499, ,0.281E-1
 0.1703, ,0.281E1
 0.0593, ,0.281E3
*BOUNDARY
ALL,2
*DIAGNOSTICS,NONHYBRID=WARNING
*STEP,INC=50
*VISCO,CETOL=7.E-3
0.01,0.5
*DLOAD
1,P4NU
*NODE FILE,NSET=INNER,FREQUENCY=1
U,RF
*EL FILE,ELSET=ELPRINT,FREQUENCY=1
S,E,CE
LOADS,
*NODE PRINT, NSET=INNER
U,RF
*EL PRINT,ELSET=ELPRINT
S,
E,
EE,
CE,
LOADS,
*END STEP