*HEADING
 TEST OF USER OUTPUT VARIABLES - UNIAXIAL TENSION TEST, CAX4E ---
*RESTART,WRITE,FREQ=5
*NODE
*ELEMENT,TYPE=CAX4E,ELSET=ALL
*ELSET,ELSET=TOP
**local orientation matching global system
*ORIENTATION,NAME=RECT
*SOLID SECTION,MATERIAL=SPZ3,ELSET=ALL,ORIENT=RECT
*MATERIAL,NAME=SPZ3
*ELASTIC,TYPE=ORTHO
13.90E6,7.428E6,11.54E6,7.784E6,7.428E6,13.90E6,2.564E6,2.564E6,
2.564E6,
*PIEZOELECTRIC,TYPE=S
*DIELECTRIC,TYPE=ANISO
*DENSITY
5555.,
*USER OUTPUT VARIABLES
*NSET,NSET=ELECTDEP
*EQUATION
ELECTDEP,9,1.0,21,9,-1.0
*NSET,NSET=BOTTOM
*BOUNDARY
BOTTOM,2
BOTTOM,9
*STEP,PERTURBATION
*STATIC
*DLOAD
TOP,P3,1.0E6
*DECHARGE
TOP,EBF,1000.
*EL PRINT,SUMMARY=NO
UVARM1,UVARM2,UVARM3,UVARM4
S,
*EL PRINT,SUMMARY=NO
UVARM5,UVARM6,UVARM7,UVARM8
E,
*EL PRINT,SUMMARY=NO
UVARM9,UVARM10,UVARM11
EFLX,
*EL PRINT,SUMMARY=NO
UVARM12,UVARM13,UVARM14
EPG,
*NODE PRINT,FREQ=0
*EL FILE
UVARM,S,E,EFLX,EPG
*END STEP