*HEADING
 TEST OF USER OUTPUT VARIABLES - UNIAXIAL TENSION TEST, T3D2 ---
*RESTART,WRITE,FREQ=5
*NODE,NSET=ALLN
*ELEMENT,TYPE=T3D2,ELSET=ALLE
*SOLID SECTION,ELSET=ALLE,MATERIAL=SMP1
*MATERIAL,NAME=SMP1
*ELASTIC
200.E3,.3
*PLASTIC,HARDENING=KINEMATIC
200.,0.
220.,.0009
*USER OUTPUT VARIABLES
*BOUNDARY
1,PINNED
2,2
*STEP,NLGEOM,INC=20
*STATIC,DIRECT
1.,20.
*BOUNDARY
2,1,,.004
*EL PRINT,FREQ=10,SUMMARY=NO
UVARM1,
ALPHA,
*EL PRINT,FREQ=10,SUMMARY=NO
UVARM2,UVARM3,UVARM4
ALPHAP,
*EL PRINT,FREQ=10,SUMMARY=NO
UVARM5,UVARM6,UVARM7,UVARM8
SINV,
*EL PRINT,FREQ=10,SUMMARY=NO
UVARM9,
E,
*EL PRINT,FREQ=10,SUMMARY=NO
UVARM10,UVARM11,UVARM12
EP,
*EL PRINT,FREQ=10,SUMMARY=NO
UVARM13,UVARM14,UVARM15
PE,
*EL PRINT,FREQ=10,SUMMARY=NO
UVARM16,UVARM17,UVARM18
PEP,
*EL PRINT,FREQ=10,SUMMARY=NO
UVARM19,UVARM20,UVARM21,UVARM22,UVARM23
ENER,
*NODE PRINT,FREQ=0
*EL FILE,FREQ=10
UVARM,ALPHA,ALPHAP,SINV,E,EP,PE,PEP,ENER
*END STEP