*HEADING
USER-DEFINED FIELD VERIFICATION: HYPOELASTICITY [CPE4]
*NODE,NSET=NALL
**
*NSET,NSET=FIX
*NSET,NSET=PULL
*ELEMENT,TYPE=CPE4,ELSET=EHYPO
*ELEMENT,TYPE=CPE4,ELSET=EFV
*SOLID SECTION,ELSET=EHYPO,MATERIAL=MHYPO
*SOLID SECTION,ELSET=EFV,MATERIAL=MFV
*MATERIAL,NAME=MHYPO
*HYPOELASTIC
*MATERIAL,NAME=MFV
*ELASTIC,DEP=1
1000.,0.,0.,0.000
 600.,0.,0.,0.010
*USER DEFINED FIELD
*BOUNDARY
NALL,2,2
FIX,1,1
**  ADD TEMPERATURES TO TEST TEMP OUTPUT
*INITIAL CONDITIONS,TYPE=TEMP
NALL,123.0
**
**
*STEP,NLGEOM,INC=100
*STATIC,DIRECT
0.01,1.0
*BOUNDARY
PULL,1,,0.01
*NODE PRINT,FREQ=99
U,RF
*ELPRINT,FREQ=99
TEMP,
MISES,PEEQ,FV1
*NODE FILE,FREQ=1
U,RF
*EL FILE,FREQ=1
S,E
ENER,
*EL FILE,FREQ=999
TEMP,
*ENDSTEP