*HEADING
USER-DEFINED FIELD VERIFICATION: HYPOELASTICITY [B21]
*NODE,NSET=NALL
*ELEMENT,TYPE=B21,ELSET=EHYPO
*ELEMENT,TYPE=B21,ELSET=EFV
*BEAM SECTION,ELSET=EHYPO,MATERIAL=MHYPO,SECTION=CIRC
0.005,
*BEAM SECTION,ELSET=EFV,MATERIAL=MFV,SECTION=CIRC
0.005,
*MATERIAL,NAME=MHYPO
*HYPOELASTIC
*MATERIAL,NAME=MFV
*ELASTIC,DEP=1
1000.,0.,0.,0.000
 600.,0.,0.,0.010
*USER DEFINED FIELD
*NSET,NSET=FIX
*NSET,NSET=PULL
*BOUNDARY
FIX,ENCASTRE
NALL,2,2
*STEP,NLGEOM,INC=200
*STATIC,DIRECT
0.01,1.0
*BOUNDARY
PULL,1,,0.01
*NODE FILE
U,RF
*OUTPUT,FIELD
*NODE OUTPUT
U,RF
*EL FILE
S,E
*OUTPUT,FIELD
*ELEMENT OUTPUT
S,E
*EL PRINT,FREQ=0
*NODE PRINT,FREQ=0
*ENDSTEP