*heading
Truss problem
Static-to-dynamic cosimulation using subcycling
*preprint, model=yes, history=yes
*node, nset=nall
*nset, nset=node2
*element, type=t3d2, elset=eall
*solid section, elset=eall, material=alle
 1.0,
*material,name=alle
*elastic
800000., 0.
*density
1.0
*boundary
1,1,3
2,2,3
*nset,nset=cn
*surface,type=node,name=CNSURF
CN,
*step, nlgeom, inc=100001
*static
0.005,1.0,,0.025
*co-simulation controls, name=ctrl, time incrementation=subcycle
*co-simulation, name=exp_std, program=ABAQUS, controls=ctrl
*co-simulation region, type=surface
CNSURF,
*output, field, number interval=1
*node output
U,
*output, history,freq=1
*node output, nset=node2
U1,
*end step