*heading
Truss problem
Dynamic-to-dynamic cosimulation using subcycling.
*preprint, model=yes, history=yes
*node, nset=nall
*nset, nset=node3
*element, type=t3d2, elset=eall
*solid section, elset=eall, material=alle
 1.0,
*material,name=alle
*elastic
 800000., 0.
*density
 1.0,
*boundary
 3,2,3
 4,2,3
*amplitude, name=ramp1, time=total
 0.,0.,1.0,1.0
*surface, type=node, name=CSURF
*step
*dynamic, explicit
,1.0
***
*CO-SIMULATION, PROGRAM=MULTIPHYSICS
*CO-SIMULATION REGION, TYPE=SURFACE, IMPORT
 CSURF, IFORCE, VT
*CO-SIMULATION REGION, TYPE=SURFACE, EXPORT
 CSURF, LUMPEDMASS, VT
***
*cload,amplitude=ramp1
 4,1,100.0
*output, field,number interval=1
*node output
 U,
*output, history,freq=1
*node output, nset=node3
 U1,
*end step