*Heading
** traction loading for axisymmetric shells
*Preprint, echo=NO, model=NO, history=NO, contact=NO
**
** PARTS
**
*Part, name=Part-1
*End Part
**
**
** ASSEMBLY
**
*Assembly, name=Assembly
**
*Instance, name=Part-1-1, part=Part-1
*Node
*Element, type=SAX2
** Region: (Section-1:Picked)
*Elset, elset=_PickedSet2, internal, generate
** Section: Section-1
*Shell Section, elset=_PickedSet2, material=Material-1
0.2, 5
*End Instance
**
*Instance, name=Part-1-2, part=Part-1
*Node
*Element, type=SAX1
** Region: (Section-1:Picked)
*Elset, elset=_PickedSet2, internal, generate
** Section: Section-1
*Shell Section, elset=_PickedSet2, material=Material-1
0.2, 5
*End Instance
**
*Nset, nset=_PickedSet6, internal, instance=Part-1-1
*Nset, nset=_PickedSet6, internal, instance=Part-1-2
*Elset, elset=_Surf-1_SNEG, internal, instance=Part-1-1, generate
*Elset, elset=_Surf-1_SNEG, internal, instance=Part-1-2, generate
*Surface, type=ELEMENT, name=Surf-1
_Surf-1_SNEG, SNEG
*End Assembly
**
** MATERIALS
**
*Material, name=Material-1
*Density
 0.0001,
*Elastic
1000., 0.3
** ----------------------------------------------------------------
**
** STEP: Step-1
**
*Step, name=Step-1, nlgeom=YES, unsymm=YES
*Static
0.1, 1., 1e-05, 1.
*Controls, parameters=field
 1.0E-6,
**
** BOUNDARY CONDITIONS
**
** Name: BC-1 Type: Displacement/Rotation
*Boundary
_PickedSet6, 2, 2
_PickedSet6, 6, 6
**
** LOADS
**
** Name: Load-1   Type: Surface traction
*Dsload
Surf-1, TRVEC, 50., 0.707107, 0.707107, 0.
**
** OUTPUT REQUESTS
**
**
** FIELD OUTPUT: F-Output-1
**
*Output, field
*Node output
u,rf
*End Step