*Heading
** Job name: test_edge Model name: Model-1
*Preprint, echo=NO, model=NO, history=NO, contact=NO
**
** PARTS
**
*Part, name=Part-1
*End Part
**
** ASSEMBLY
**
*Assembly, name=Assembly
**
*Instance, name=Part-1-1, part=Part-1
*Node
*Element, type=S4
** Region: (Section-1:Picked)
*Elset, elset=_PickedSet2, internal, generate
** Section: Section-1
*Shell Section, elset=_PickedSet2, material=Material-1
0.5, 5
*End Instance
*Nset, nset=_PickedSet4, internal, instance=Part-1-1
*Elset, elset=_PickedSet4, internal, instance=Part-1-1
*Nset, nset=Set-1, instance=Part-1-1
*Elset, elset=Set-1, instance=Part-1-1
*Elset, elset=_Surf-1_E2, internal, instance=Part-1-1
*Surface, type=ELEMENT, name=Surf-1
_Surf-1_E2, E2
*End Assembly
**
** MATERIALS
**
*Material, name=Material-1
*Elastic
100., 0.3
** ----------------------------------------------------------------
**
** STEP: Step-1
**
*Step, name=Step-1, nlgeom=YES, unsymm=YES
*Static
0.01, 0.1, 1e-06, 0.1
**
** BOUNDARY CONDITIONS
**
** Name: BC-1 Type: Displacement/Rotation
*Boundary
_PickedSet4, 1, 1
_PickedSet4, 2, 2
_PickedSet4, 3, 3
_PickedSet4, 4, 4
_PickedSet4, 5, 5
_PickedSet4, 6, 6
**
** LOADS
**
** Name: Load-1   Type: Pressure
*Dsload,follower=yes
Surf-1, edldnu, 1.0d-1,0,0,1
**
** OUTPUT REQUESTS
**
*Restart, write, frequency=1
**
** FIELD OUTPUT: F-Output-1
**
*Output, field
*Node output
u,rf
*End Step