*Heading
** edge loading test
*Preprint, echo=NO, model=NO, history=NO, contact=NO
**
** PARTS
**
*Part, name=Part-1
*End Part
**
** ASSEMBLY
**
*Assembly, name=Assembly
**
*Instance, name=Part-1-1, part=Part-1
*Node
*Element, type=S3R
*Node
*Nset, nset=Part-1-1-RefPt_, internal
** Region: (Section-1:Picked)
*Elset, elset=_PickedSet3, internal, generate
** Section: Section-1
*Shell Section, elset=_PickedSet3, material=Material-1
1., 5
*End Instance
**
*Instance, name=Part-1-1-2-1, part=Part-1
*Node
*Element, type=S4R
*Node
*Nset, nset=Part-1-1-2-1-RefPt_, internal
** Region: (Section-1:Picked)
*Elset, elset=_PickedSet3, internal, generate
** Section: Section-1
*Shell Section, elset=_PickedSet3, material=Material-1
1., 5
*End Instance
**
*Instance, name=Part-1-1-3-1, part=Part-1
*Node
*Element, type=S3R
*Node
*Nset, nset=Part-1-1-3-1-RefPt_, internal
** Region: (Section-1:Picked)
*Elset, elset=_PickedSet3, internal, generate
** Section: Section-1
*Shell Section, elset=_PickedSet3, material=Material-1
1., 5
*End Instance
**
*Instance, name=Part-1-1-4-1, part=Part-1
*Node
*Element, type=S4R
*Node
*Nset, nset=Part-1-1-4-1-RefPt_, internal
** Region: (Section-1:Picked)
*Elset, elset=_PickedSet3, internal, generate
** Section: Section-1
*Shell Section, elset=_PickedSet3, material=Material-1
1., 5
*End Instance
**
*Instance, name=Part-1-1-5-1, part=Part-1
*Node
*Element, type=S4R
*Node
*Nset, nset=Part-1-1-5-1-RefPt_, internal
** Region: (Section-1:Picked)
*Elset, elset=_PickedSet3, internal, generate
** Section: Section-1
*Shell Section, elset=_PickedSet3, material=Material-1
1., 5
*End Instance
*Nset, nset=_PickedSet13, internal, instance=Part-1-1
*Nset, nset=_PickedSet15, internal, instance=Part-1-1-2-1
*Nset, nset=_PickedSet17, internal, instance=Part-1-1-3-1
*Nset, nset=_PickedSet19, internal, instance=Part-1-1-4-1
*Nset, nset=_PickedSet21, internal, instance=Part-1-1-5-1
*Nset, nset=_PickedSet22, internal, instance=Part-1-1
*Nset, nset=_PickedSet22, internal, instance=Part-1-1-2-1
*Nset, nset=_PickedSet22, internal, instance=Part-1-1-4-1
*Nset, nset=_PickedSet22, internal, instance=Part-1-1-3-1
*Nset, nset=_PickedSet22, internal, instance=Part-1-1-5-1
*Elset, elset=_Surf-1_E2, internal, instance=Part-1-1
*Surface, type=ELEMENT, name=Surf-1
_Surf-1_E2, E2
*Elset, elset=_Surf-2_E3, internal, instance=Part-1-1-2-1
*Surface, type=ELEMENT, name=Surf-2
_Surf-2_E3, E3
*Elset, elset=_Surf-3_E3, internal, instance=Part-1-1-3-1
*Elset, elset=_Surf-3_E1, internal, instance=Part-1-1-3-1
*Surface, type=ELEMENT, name=Surf-3
_Surf-3_E3, E3
_Surf-3_E1, E1
*Elset, elset=_Surf-4_E1, internal, instance=Part-1-1-4-1
*Surface, type=ELEMENT, name=Surf-4
_Surf-4_E1, E1
*Elset, elset=_Surf-5_E2, internal, instance=Part-1-1-5-1
*Surface, type=ELEMENT, name=Surf-5
_Surf-5_E2, E2
*Elset, elset=__PickedSurf39_SPOS, internal, instance=Part-1-1, generate
*Surface, type=ELEMENT, name=_PickedSurf39, internal
__PickedSurf39_SPOS, SPOS
*Elset, elset=__PickedSurf40_SPOS, internal, instance=Part-1-1-2-1, generate
*Surface, type=ELEMENT, name=_PickedSurf40, internal
__PickedSurf40_SPOS, SPOS
*Elset, elset=__PickedSurf41_SPOS, internal, instance=Part-1-1-3-1, generate
*Surface, type=ELEMENT, name=_PickedSurf41, internal
__PickedSurf41_SPOS, SPOS
*Elset, elset=__PickedSurf42_SPOS, internal, instance=Part-1-1-4-1, generate
*Surface, type=ELEMENT, name=_PickedSurf42, internal
__PickedSurf42_SPOS, SPOS
*Elset, elset=__PickedSurf43_SPOS, internal, instance=Part-1-1-5-1, generate
*Surface, type=ELEMENT, name=_PickedSurf43, internal
__PickedSurf43_SPOS, SPOS
** Constraint: Constraint-1
*Coupling, constraint name=Constraint-1, ref node=_PickedSet13, surface=_PickedSurf39
*Kinematic
1, 1
2, 2
3, 3
** Constraint: Constraint-2
*Coupling, constraint name=Constraint-2, ref node=_PickedSet15, surface=_PickedSurf40
*Kinematic
1, 1
2, 2
3, 3
** Constraint: Constraint-3
*Coupling, constraint name=Constraint-3, ref node=_PickedSet17, surface=_PickedSurf41
*Kinematic
1, 1
2, 2
3, 3
** Constraint: Constraint-4
*Coupling, constraint name=Constraint-4, ref node=_PickedSet19, surface=_PickedSurf42
*Kinematic
1, 1
2, 2
3, 3
** Constraint: Constraint-5
*Coupling, constraint name=Constraint-5, ref node=_PickedSet21, surface=_PickedSurf43
*Kinematic
1, 1
2, 2
3, 3
*End Assembly
*Amplitude, name=Amp-1
0., 0., 1., 1.
**
** MATERIALS
**
*Material, name=Material-1
*Density
 0.0001,
*Elastic
1000., 0.3
** ----------------------------------------------------------------
**
** STEP: Step-1
**
*Step, name=Step-1
*Dynamic, Explicit
, 1.
*Bulk Viscosity
**
** BOUNDARY CONDITIONS
**
** Name: BC-1 Type: Displacement/Rotation
*Boundary
_PickedSet22, 1, 1
_PickedSet22, 2, 2
_PickedSet22, 3, 3
_PickedSet22, 4, 4
_PickedSet22, 5, 5
_PickedSet22, 6, 6
**
** LOADS
**
** Name: Load-1   Type: Shell edge load
*Dsload, amplitude=Amp-1
Surf-1, EDNOR, 1.
** Name: Load-2   Type: Shell edge load
*Dsload, amplitude=Amp-1
Surf-2, EDTRA, 1.
** Name: Load-3   Type: Shell edge load
*Dsload, amplitude=Amp-1
Surf-3, EDSHR, 1.
** Name: Load-4   Type: Shell edge load
*Dsload, amplitude=Amp-1
Surf-4, EDMOM, 1.
** Name: Load-5   Type: Shell edge load
*Dsload, amplitude=Amp-1
Surf-5, EDLD, 1.414, 0.707107, 0.707107, 0.
**
** OUTPUT REQUESTS
**
**
** FIELD OUTPUT: F-Output-1
**
*Output, field, number=6
*Node output
u,rf
*End Step