*Heading
** Job name: Job-1 Model name: Model-1
*Preprint, echo=NO, model=NO, history=NO, contact=NO
**
** PARTS
**
*Part, name=Part-1
*End Part
**
** ASSEMBLY
**
*Assembly, name=Assembly
**
*Instance, name=Part-1-1, part=Part-1
*Node
*Element, type=S3
*Node
*Nset, nset=Part-1-1-RefPt_, internal
** Region: (Section-1:Picked)
*Elset, elset=_PickedSet3, internal, generate
** Section: Section-1
*Shell Section, elset=_PickedSet3, material=Material-1
0.1, 5
*End Instance
**
*Instance, name=Part-1-2, part=Part-1
*Node
*Element, type=STRI3
*Node
*Nset, nset=Part-1-2-RefPt_, internal
** Region: (Section-1:Picked)
*Elset, elset=_PickedSet3, internal, generate
** Section: Section-1
*Shell Section, elset=_PickedSet3, material=Material-1
0.1, 5
*End Instance
**
*Instance, name=Part-1-3, part=Part-1
*Node
*Element, type=S4R
*Node
*Nset, nset=Part-1-3-RefPt_, internal
** Region: (Section-1:Picked)
*Elset, elset=_PickedSet3, internal, generate
** Section: Section-1
*Shell Section, elset=_PickedSet3, material=Material-1
0.1, 5
*End Instance
**
*Instance, name=Part-1-4, part=Part-1
*Node
*Element, type=S4R5
*Node
*Nset, nset=Part-1-4-RefPt_, internal
** Region: (Section-1:Picked)
*Elset, elset=_PickedSet3, internal, generate
** Section: Section-1
*Shell Section, elset=_PickedSet3, material=Material-1
0.1, 5
*End Instance
**
*Instance, name=Part-1-5, part=Part-1
*Node
*Element, type=STRI65
*Node
*Nset, nset=Part-1-5-RefPt_, internal
** Region: (Section-1:Picked)
*Elset, elset=_PickedSet3, internal, generate
** Section: Section-1
*Shell Section, elset=_PickedSet3, material=Material-1
0.1, 5
*End Instance
**
*Instance, name=Part-1-6, part=Part-1
*Node
*Element, type=S8R
*Node
*Nset, nset=Part-1-6-RefPt_, internal
** Region: (Section-1:Picked)
*Elset, elset=_PickedSet3, internal, generate
** Section: Section-1
*Shell Section, elset=_PickedSet3, material=Material-1
0.1, 5
*End Instance
**
*Instance, name=Part-1-7, part=Part-1
*Node
*Element, type=S8R5
*Node
*Nset, nset=Part-1-7-RefPt_, internal
** Region: (Section-1:Picked)
*Elset, elset=_PickedSet3, internal, generate
** Section: Section-1
*Shell Section, elset=_PickedSet3, material=Material-1
0.1, 5
*End Instance
*Nset, nset=_PickedSet16, internal, instance=Part-1-1
*Nset, nset=_PickedSet17, internal, instance=Part-1-1
*Nset, nset=_PickedSet18, internal, instance=Part-1-2
*Nset, nset=_PickedSet19, internal, instance=Part-1-2
*Nset, nset=_PickedSet21, internal, instance=Part-1-3
*Nset, nset=_PickedSet23, internal, instance=Part-1-4
*Nset, nset=_PickedSet24, internal, instance=Part-1-5
*Nset, nset=_PickedSet25, internal, instance=Part-1-5
*Nset, nset=_PickedSet27, internal, instance=Part-1-6
*Nset, nset=_PickedSet29, internal, instance=Part-1-7
*Nset, nset=boun, instance=Part-1-1
*Nset, nset=boun, instance=Part-1-2
*Nset, nset=boun, instance=Part-1-4
*Nset, nset=boun, instance=Part-1-6
*Nset, nset=boun, instance=Part-1-3
*Nset, nset=boun, instance=Part-1-5
*Nset, nset=boun, instance=Part-1-7
*Nset, nset=_PickedSet49, internal, instance=Part-1-3, generate
*Elset, elset=_PickedSet49, internal, instance=Part-1-3
*Nset, nset=_PickedSet50, internal, instance=Part-1-4, generate
*Elset, elset=_PickedSet50, internal, instance=Part-1-4
*Nset, nset=_PickedSet51, internal, instance=Part-1-6
*Elset, elset=_PickedSet51, internal, instance=Part-1-6
*Nset, nset=_PickedSet52, internal, instance=Part-1-7
*Elset, elset=_PickedSet52, internal, instance=Part-1-7
*Elset, elset=_loadSurf_SPOS, internal, instance=Part-1-1, generate
*Elset, elset=_loadSurf_SPOS, internal, instance=Part-1-2, generate
*Elset, elset=_loadSurf_SPOS, internal, instance=Part-1-4, generate
*Elset, elset=_loadSurf_SPOS, internal, instance=Part-1-6, generate
*Elset, elset=_loadSurf_SPOS, internal, instance=Part-1-3, generate
*Elset, elset=_loadSurf_SPOS, internal, instance=Part-1-5, generate
*Elset, elset=_loadSurf_SPOS, internal, instance=Part-1-7, generate
*Surface, type=ELEMENT, name=loadSurf
_loadSurf_SPOS, SPOS
*Surface, type=NODE, name=_PickedSet16_CNS_, internal
_PickedSet16, 1.
*Surface, type=NODE, name=_PickedSet18_CNS_, internal
_PickedSet18, 1.
*Surface, type=NODE, name=_PickedSet49_CNS_, internal
_PickedSet49, 1.
*Surface, type=NODE, name=_PickedSet50_CNS_, internal
_PickedSet50, 1.
*Surface, type=NODE, name=_PickedSet24_CNS_, internal
_PickedSet24, 1.
*Surface, type=NODE, name=_PickedSet51_CNS_, internal
_PickedSet51, 1.
*Surface, type=NODE, name=_PickedSet52_CNS_, internal
_PickedSet52, 1.
** Constraint: Constraint-1
*Coupling, constraint name=Constraint-1, ref node=_PickedSet17, surface=_PickedSet16_CNS_
*Kinematic
** Constraint: Constraint-2
*Coupling, constraint name=Constraint-2, ref node=_PickedSet19, surface=_PickedSet18_CNS_
*Kinematic
** Constraint: Constraint-3
*Coupling, constraint name=Constraint-3, ref node=_PickedSet21, surface=_PickedSet49_CNS_
*Kinematic
** Constraint: Constraint-4
*Coupling, constraint name=Constraint-4, ref node=_PickedSet23, surface=_PickedSet50_CNS_
*Kinematic
** Constraint: Constraint-5
*Coupling, constraint name=Constraint-5, ref node=_PickedSet25, surface=_PickedSet24_CNS_
*Kinematic
** Constraint: Constraint-6
*Coupling, constraint name=Constraint-6, ref node=_PickedSet27, surface=_PickedSet51_CNS_
*Kinematic
** Constraint: Constraint-7
*Coupling, constraint name=Constraint-7, ref node=_PickedSet29, surface=_PickedSet52_CNS_
*Kinematic
*End Assembly
**
** MATERIALS
**
*Material, name=Material-1
*Elastic
400., 0.3
** ----------------------------------------------------------------
**
** STEP: Step-1
**
*Step, name=Step-1, nlgeom=YES, unsymm=YES
*Static
0.1, 1., 1e-05, 1.
**
** BOUNDARY CONDITIONS
**
** Name: BC-1 Type: Displacement/Rotation
*Boundary
boun, 1, 1
boun, 2, 2
boun, 3, 3
boun, 4, 4
boun, 5, 5
boun, 6, 6
**
** LOADS
**
** Name: Load-1   Type: Surface traction
*Dsload
loadSurf, TRSHR, 1., 0., 1., 0.
**
** OUTPUT REQUESTS
**
*Restart, write, frequency=1
**
** FIELD OUTPUT: F-Output-1
**
*Output, field, variable=PRESELECT
**
** HISTORY OUTPUT: H-Output-1
**
*Output, history, variable=PRESELECT
**
** HISTORY OUTPUT: H-Output-2
**
*Output, history
*Node Output, nset=boun
RF1, RF2, RF3, RM1, RM2, RM3
*End Step
** ----------------------------------------------------------------
**
** STEP: Step-2
**
*Step, name=Step-2, nlgeom=YES, unsymm=YES
*Static
0.1, 1., 1e-05, 1.
**
** BOUNDARY CONDITIONS
**
** Name: BC-1 Type: Displacement/Rotation
*Boundary
boun, 6, 6, 1.57
**
** OUTPUT REQUESTS
**
*Restart, write, frequency=1
**
** FIELD OUTPUT: F-Output-1
**
*Output, field, variable=PRESELECT
**
** HISTORY OUTPUT: H-Output-1
**
*Output, history, variable=PRESELECT
**
** HISTORY OUTPUT: H-Output-2
**
*Output, history
*Node Output, nset=boun
RF1, RF2, RF3, RM1, RM2, RM3
*End Step
** ----------------------------------------------------------------
**
** STEP: Step-3
**
*Step, name=Step-3, nlgeom=YES, unsymm=YES
*Static
0.1, 1., 1e-05, 1.
**
** BOUNDARY CONDITIONS
**
** Name: BC-1 Type: Displacement/Rotation
*Boundary
boun, 6, 6
**
** LOADS
**
** Name: Load-1   Type: Surface traction
*Dsload
loadSurf, TRSHR, 0., 0., 1., 0.
**
** OUTPUT REQUESTS
**
*Restart, write, frequency=1
**
** FIELD OUTPUT: F-Output-1
**
*Output, field, variable=PRESELECT
**
** HISTORY OUTPUT: H-Output-1
**
*Output, history, variable=PRESELECT
**
** HISTORY OUTPUT: H-Output-2
**
*Output, history
*Node Output, nset=boun
RF1, RF2, RF3, RM1, RM2, RM3
*End Step
** ----------------------------------------------------------------
**
** STEP: Step-4
**
*Step, name=Step-4, nlgeom=YES, unsymm=YES
*Static
0.1, 1., 1e-05, 1.
**
** BOUNDARY CONDITIONS
**
** Name: BC-1 Type: Displacement/Rotation
*Boundary
boun, 1, 1
boun, 2, 2
boun, 3, 3
boun, 4, 4
boun, 5, 5
boun, 6, 6
**
** LOADS
**
** Name: Load-1   Type: Surface traction
*Dsload
loadSurf, TRVEC, 1., 0., 1., 0.
**
** OUTPUT REQUESTS
**
*Restart, write, frequency=1
**
** FIELD OUTPUT: F-Output-1
**
*Output, field, variable=PRESELECT
**
** HISTORY OUTPUT: H-Output-1
**
*Output, history, variable=PRESELECT
**
** HISTORY OUTPUT: H-Output-2
**
*Output, history
*Node Output, nset=boun
RF1, RF2, RF3, RM1, RM2, RM3
*End Step
** ----------------------------------------------------------------
**
** STEP: Step-5
**
*Step, name=Step-5, nlgeom=YES, unsymm=YES
*Static
0.1, 1., 1e-05, 1.
**
** BOUNDARY CONDITIONS
**
** Name: BC-1 Type: Displacement/Rotation
*Boundary
boun, 6, 6, 1.57
**
** OUTPUT REQUESTS
**
*Restart, write, frequency=1
**
** FIELD OUTPUT: F-Output-1
**
*Output, field, variable=PRESELECT
**
** HISTORY OUTPUT: H-Output-1
**
*Output, history, variable=PRESELECT
**
** HISTORY OUTPUT: H-Output-2
**
*Output, history
*Node Output, nset=boun
RF1, RF2, RF3, RM1, RM2, RM3
*End Step
** ----------------------------------------------------------------
**
** STEP: Step-6
**
*Step, name=Step-6, nlgeom=YES, unsymm=YES
*Static
0.1, 1., 1e-05, 1.
**
** BOUNDARY CONDITIONS
**
** Name: BC-1 Type: Displacement/Rotation
*Boundary
boun, 6, 6
**
** LOADS
**
** Name: Load-1   Type: Surface traction
*Dsload
loadSurf, TRVEC, 0., 0., 1., 0.
**
** OUTPUT REQUESTS
**
*Restart, write, frequency=1
**
** FIELD OUTPUT: F-Output-1
**
*Output, field, variable=PRESELECT
**
** HISTORY OUTPUT: H-Output-1
**
*Output, history, variable=PRESELECT
**
** HISTORY OUTPUT: H-Output-2
**
*Output, history
*Node Output, nset=boun
RF1, RF2, RF3, RM1, RM2, RM3
*End Step
** ----------------------------------------------------------------
**
** STEP: Step-7
**
*Step, name=Step-7, nlgeom=YES, unsymm=YES
*Static
0.1, 1., 1e-05, 1.
**
** BOUNDARY CONDITIONS
**
** Name: BC-1 Type: Displacement/Rotation
*Boundary
boun, 1, 1
boun, 2, 2
boun, 3, 3
boun, 4, 4
boun, 5, 5
boun, 6, 6
**
** LOADS
**
** Name: Load-1   Type: Surface traction
*Dsload, follower=no
loadSurf, TRVEC, 1., 0., 1., 0.
**
** OUTPUT REQUESTS
**
*Restart, write, frequency=1
**
** FIELD OUTPUT: F-Output-1
**
*Output, field, variable=PRESELECT
**
** HISTORY OUTPUT: H-Output-1
**
*Output, history, variable=PRESELECT
**
** HISTORY OUTPUT: H-Output-2
**
*Output, history
*Node Output, nset=boun
RF1, RF2, RF3, RM1, RM2, RM3
*End Step
** ----------------------------------------------------------------
**
** STEP: Step-8
**
*Step, name=Step-8, nlgeom=YES, unsymm=YES
*Static
0.1, 1., 1e-05, 1.
**
** BOUNDARY CONDITIONS
**
** Name: BC-1 Type: Displacement/Rotation
*Boundary
boun, 6, 6, 1.57
**
** OUTPUT REQUESTS
**
*Restart, write, frequency=1
**
** FIELD OUTPUT: F-Output-1
**
*Output, field, variable=PRESELECT
**
** HISTORY OUTPUT: H-Output-1
**
*Output, history, variable=PRESELECT
**
** HISTORY OUTPUT: H-Output-2
**
*Output, history
*Node Output, nset=boun
RF1, RF2, RF3, RM1, RM2, RM3
*End Step
** ----------------------------------------------------------------
**
** STEP: Step-9
**
*Step, name=Step-9, nlgeom=YES, unsymm=YES
*Static
0.1, 1., 1e-05, 1.
**
** BOUNDARY CONDITIONS
**
** Name: BC-1 Type: Displacement/Rotation
*Boundary
boun, 6, 6
**
** LOADS
**
** Name: Load-1   Type: Surface traction
*Dsload, follower=no
loadSurf, TRVEC, 0., 0., 1., 0.
**
** OUTPUT REQUESTS
**
*Restart, write, frequency=1
**
** FIELD OUTPUT: F-Output-1
**
*Output, field, variable=PRESELECT
**
** HISTORY OUTPUT: H-Output-1
**
*Output, history, variable=PRESELECT
**
** HISTORY OUTPUT: H-Output-2
**
*Output, history
*Node Output, nset=boun
RF1, RF2, RF3, RM1, RM2, RM3
*End Step
** ----------------------------------------------------------------
**
** STEP: Step-10
**
*Step, name=Step-10, nlgeom=YES, unsymm=YES
*Static
0.1, 1., 1e-05, 1.
**
** BOUNDARY CONDITIONS
**
** Name: BC-1 Type: Displacement/Rotation
*Boundary
boun, 1, 1
boun, 2, 2
boun, 3, 3
boun, 4, 4
boun, 5, 5
boun, 6, 6
**
** LOADS
**
** Name: Load-1   Type: Surface traction
*Dsload, follower=no, constant resultant=yes
loadSurf, TRVEC, 1., 0., 1., 0.
**
** OUTPUT REQUESTS
**
*Restart, write, frequency=1
**
** FIELD OUTPUT: F-Output-1
**
*Output, field, variable=PRESELECT
**
** HISTORY OUTPUT: H-Output-1
**
*Output, history, variable=PRESELECT
**
** HISTORY OUTPUT: H-Output-2
**
*Output, history
*Node Output, nset=boun
RF1, RF2, RF3, RM1, RM2, RM3
*End Step
** ----------------------------------------------------------------
**
** STEP: Step-11
**
*Step, name=Step-11, nlgeom=YES, unsymm=YES
*Static
0.1, 1., 1e-05, 1.
**
** BOUNDARY CONDITIONS
**
** Name: BC-1 Type: Displacement/Rotation
*Boundary
boun, 6, 6, 1.57
**
** OUTPUT REQUESTS
**
*Restart, write, frequency=1
**
** FIELD OUTPUT: F-Output-1
**
*Output, field, variable=PRESELECT
**
** HISTORY OUTPUT: H-Output-1
**
*Output, history, variable=PRESELECT
**
** HISTORY OUTPUT: H-Output-2
**
*Output, history
*Node Output, nset=boun
RF1, RF2, RF3, RM1, RM2, RM3
*End Step
** ----------------------------------------------------------------
**
** STEP: Step-12
**
*Step, name=Step-12, nlgeom=YES, unsymm=YES
*Static
0.1, 1., 1e-05, 1.
**
** BOUNDARY CONDITIONS
**
** Name: BC-1 Type: Displacement/Rotation
*Boundary
boun, 6, 6
**
** LOADS
**
** Name: Load-1   Type: Surface traction
*Dsload, follower=no, constant resultant=yes
loadSurf, TRVEC, 0., 0., 1., 0.
**
** OUTPUT REQUESTS
**
*Restart, write, frequency=1
**
** FIELD OUTPUT: F-Output-1
**
*Output, field, variable=PRESELECT
**
** HISTORY OUTPUT: H-Output-1
**
*Output, history, variable=PRESELECT
**
** HISTORY OUTPUT: H-Output-2
**
*Output, history
*Node Output, nset=boun
RF1, RF2, RF3, RM1, RM2, RM3
*End Step