*Heading
** Job name: Job-1 Model name: Model-1
*Preprint, echo=NO, model=NO, history=NO, contact=NO
**
** PARTS
**
*Part, name=Part-1
*End Part
**
** ASSEMBLY
**
*Assembly, name=Assembly
**
*Instance, name=Part-1-1, part=Part-1
*Node
*Element, type=C3D4
*Node
*Nset, nset=Part-1-1-RefPt_, internal
** Region: (Section-1:Picked)
*Elset, elset=_PickedSet2, internal, generate
** Section: Section-1
*Solid Section, elset=_PickedSet2, material=Material-1
1.,
*End Instance
**
*Instance, name=Part-1-2, part=Part-1
*Node
*Element, type=C3D10
*Node
*Nset, nset=Part-1-2-RefPt_, internal
** Region: (Section-1:Picked)
*Elset, elset=_PickedSet2, internal, generate
** Section: Section-1
*Solid Section, elset=_PickedSet2, material=Material-1
1.,
*End Instance
**
*Instance, name=Part-1-3, part=Part-1
*Node
*Element, type=C3D10M
*Node
*Nset, nset=Part-1-3-RefPt_, internal
** Region: (Section-1:Picked)
*Elset, elset=_PickedSet2, internal, generate
** Section: Section-1
*Solid Section, elset=_PickedSet2, material=Material-1
1.,
*End Instance
**
*Instance, name=Part-1-4, part=Part-1
*Node
*Element, type=C3D6
*Node
*Nset, nset=Part-1-4-RefPt_, internal
** Region: (Section-1:Picked)
*Elset, elset=_PickedSet2, internal, generate
** Section: Section-1
*Solid Section, elset=_PickedSet2, material=Material-1
1.,
*End Instance
**
*Instance, name=Part-1-5, part=Part-1
*Node
*Element, type=C3D15
*Node
*Nset, nset=Part-1-5-RefPt_, internal
** Region: (Section-1:Picked)
*Elset, elset=_PickedSet2, internal, generate
** Section: Section-1
*Solid Section, elset=_PickedSet2, material=Material-1
1.,
*End Instance
**
*Instance, name=Part-1-6, part=Part-1
*Node
*Element, type=C3D8R
*Node
*Nset, nset=Part-1-6-RefPt_, internal
** Region: (Section-1:Picked)
*Elset, elset=_PickedSet2, internal, generate
** Section: Section-1
*Solid Section, elset=_PickedSet2, material=Material-1
1.,
*End Instance
**
*Instance, name=Part-1-7, part=Part-1
*Node
*Element, type=C3D20R
*Node
*Nset, nset=Part-1-7-RefPt_, internal
** Region: (Section-1:Picked)
*Elset, elset=_PickedSet2, internal, generate
** Section: Section-1
*Solid Section, elset=_PickedSet2, material=Material-1
1.,
*End Instance
**
*Instance, name=Part-1-8, part=Part-1
*Node
*Element, type=C3D5
*Node
*Nset, nset=Part-1-8-RefPt_, internal
** Region: (Section-1:Picked)
*Elset, elset=_PickedSet2, internal, generate
** Section: Section-1
*Solid Section, elset=_PickedSet2, material=Material-1
1.,
*End Instance
**
**
*Nset, nset=_PickedSet16, internal, instance=Part-1-1
*Elset, elset=_PickedSet16, internal, instance=Part-1-1
*Nset, nset=_PickedSet17, internal, instance=Part-1-1
*Nset, nset=_PickedSet18, internal, instance=Part-1-2
*Elset, elset=_PickedSet18, internal, instance=Part-1-2
*Nset, nset=_PickedSet19, internal, instance=Part-1-2
*Nset, nset=_PickedSet20, internal, instance=Part-1-3
*Elset, elset=_PickedSet20, internal, instance=Part-1-3
*Nset, nset=_PickedSet21, internal, instance=Part-1-3
*Nset, nset=_PickedSet22, internal, instance=Part-1-4
*Elset, elset=_PickedSet22, internal, instance=Part-1-4
*Nset, nset=_PickedSet23, internal, instance=Part-1-4
*Nset, nset=_PickedSet24, internal, instance=Part-1-5
*Elset, elset=_PickedSet24, internal, instance=Part-1-5
*Nset, nset=_PickedSet25, internal, instance=Part-1-5
*Nset, nset=_PickedSet26, internal, instance=Part-1-6
*Elset, elset=_PickedSet26, internal, instance=Part-1-6
*Nset, nset=_PickedSet27, internal, instance=Part-1-6
*Nset, nset=_PickedSet28, internal, instance=Part-1-7
*Elset, elset=_PickedSet28, internal, instance=Part-1-7
*Nset, nset=_PickedSet29, internal, instance=Part-1-7
*Nset, nset=_PickedSet30, internal, instance=Part-1-8
*Nset, nset=_PickedSet31, internal, instance=Part-1-8
*Nset, nset=boundary, instance=Part-1-1
*Nset, nset=boundary, instance=Part-1-2
*Nset, nset=boundary, instance=Part-1-4
*Nset, nset=boundary, instance=Part-1-6
*Nset, nset=boundary, instance=Part-1-3
*Nset, nset=boundary, instance=Part-1-5
*Nset, nset=boundary, instance=Part-1-7
*Nset, nset=boundary, instance=Part-1-8
*Elset, elset=_loadSurf_S3, internal, instance=Part-1-1
*Elset, elset=_loadSurf_S3, internal, instance=Part-1-2
*Elset, elset=_loadSurf_S3, internal, instance=Part-1-4
*Elset, elset=_loadSurf_S3, internal, instance=Part-1-6
*Elset, elset=_loadSurf_S3, internal, instance=Part-1-3
*Elset, elset=_loadSurf_S3, internal, instance=Part-1-5
*Elset, elset=_loadSurf_S3, internal, instance=Part-1-7
*Elset, elset=_loadSurf_S4, internal, instance=Part-1-1
*Elset, elset=_loadSurf_S4, internal, instance=Part-1-2
*Elset, elset=_loadSurf_S4, internal, instance=Part-1-3
*Elset, elset=_loadSurf_S3, internal, instance=Part-1-8
*Elset, elset=_loadSurf_S4, internal, instance=Part-1-8
*Surface, type=ELEMENT, name=loadSurf
_loadSurf_S3, S3
_loadSurf_S4, S4
*Surface, type=NODE, name=_PickedSet16_CNS_, internal
_PickedSet16, 1.
*Surface, type=NODE, name=_PickedSet18_CNS_, internal
_PickedSet18, 1.
*Surface, type=NODE, name=_PickedSet20_CNS_, internal
_PickedSet20, 1.
*Surface, type=NODE, name=_PickedSet22_CNS_, internal
_PickedSet22, 1.
*Surface, type=NODE, name=_PickedSet24_CNS_, internal
_PickedSet24, 1.
*Surface, type=NODE, name=_PickedSet26_CNS_, internal
_PickedSet26, 1.
*Surface, type=NODE, name=_PickedSet28_CNS_, internal
_PickedSet28, 1.
*Surface, type=NODE, name=_PickedSet30_CNS_, internal
_PickedSet30, 1.
** Constraint: Constraint-1
*Coupling, constraint name=Constraint-1, ref node=_PickedSet17, surface=_PickedSet16_CNS_
*Kinematic
** Constraint: Constraint-2
*Coupling, constraint name=Constraint-2, ref node=_PickedSet19, surface=_PickedSet18_CNS_
*Kinematic
** Constraint: Constraint-3
*Coupling, constraint name=Constraint-3, ref node=_PickedSet21, surface=_PickedSet20_CNS_
*Kinematic
** Constraint: Constraint-4
*Coupling, constraint name=Constraint-4, ref node=_PickedSet23, surface=_PickedSet22_CNS_
*Kinematic
** Constraint: Constraint-5
*Coupling, constraint name=Constraint-5, ref node=_PickedSet25, surface=_PickedSet24_CNS_
*Kinematic
** Constraint: Constraint-6
*Coupling, constraint name=Constraint-6, ref node=_PickedSet27, surface=_PickedSet26_CNS_
*Kinematic
** Constraint: Constraint-7
*Coupling, constraint name=Constraint-7, ref node=_PickedSet29, surface=_PickedSet28_CNS_
*Kinematic
** Constraint: Constraint-8
*Coupling, constraint name=Constraint-8, ref node=_PickedSet31, surface=_PickedSet30_CNS_
*Kinematic
*End Assembly
**
** MATERIALS
**
*Material, name=Material-1
*Elastic
100., 0.3
** ----------------------------------------------------------------
**
** STEP: Step-1
**
*Step, name=Step-1, nlgeom=YES, unsymm=YES
*Static
0.1, 1., 1e-05, 1.
**
** BOUNDARY CONDITIONS
**
** Name: BC-1 Type: Displacement/Rotation
*Boundary
boundary, 1, 1
boundary, 2, 2
boundary, 3, 3
boundary, 4, 4
boundary, 5, 5
boundary, 6, 6
**
** LOADS
**
** Name: Load-1   Type: Surface traction
*Dsload, follower=YES
loadSurf, TRSHR, 1., 1., 0., 0.
**
** OUTPUT REQUESTS
**
** FIELD OUTPUT: F-Output-1
**
*Output, field, variable=PRESELECT
**
** HISTORY OUTPUT: H-Output-1
**
*Output, history, variable=PRESELECT
*Node output, nset=boundary
RF,
*End Step
** ----------------------------------------------------------------
**
** STEP: Step-2
**
*Step, name=Step-2, nlgeom=YES, unsymm=YES
*Static
0.1, 1., 1e-05, 1.
**
** BOUNDARY CONDITIONS
**
** Name: BC-2 Type: Displacement/Rotation
*Boundary
boundary, 1, 1
boundary, 2, 2
boundary, 3, 3
boundary, 4, 4
boundary, 5, 5, 1.5708
boundary, 6, 6
**
** LOADS
**
** Name: Load-1   Type: Surface traction
*Dsload, follower=YES
loadSurf, TRSHR, 1., 1., 0., 0.
**
** OUTPUT REQUESTS
**
** FIELD OUTPUT: F-Output-1
**
*Output, field, variable=PRESELECT
**
** HISTORY OUTPUT: H-Output-1
**
*Output, history, variable=PRESELECT
*Node output, nset=boundary
RF,
*End Step
** ----------------------------------------------------------------
**
** STEP: Step-3
**
*Step, name=Step-3, nlgeom=YES, unsymm=YES
*Static
0.1, 1., 1e-05, 1.
**
** BOUNDARY CONDITIONS
**
** Name: BC-3 Type: Displacement/Rotation
*Boundary
boundary, 1, 1
boundary, 2, 2
boundary, 3, 3
boundary, 4, 4
boundary, 5, 5
boundary, 6, 6
**
** LOADS
**
** Name: Load-1   Type: Surface traction
*Dsload, follower=YES
loadSurf, TRSHR, 0., 1., 0., 0.
**
** OUTPUT REQUESTS
**
** FIELD OUTPUT: F-Output-1
**
*Output, field, variable=PRESELECT
**
** HISTORY OUTPUT: H-Output-1
**
*Output, history, variable=PRESELECT
*Node output, nset=boundary
RF,
*End Step
** ----------------------------------------------------------------
**
** STEP: Step-4
**
*Step, name=Step-4, nlgeom=YES, unsymm=YES
*Static
0.1, 1., 1e-05, 1.
**
** BOUNDARY CONDITIONS
**
** Name: BC-1 Type: Displacement/Rotation
*Boundary
boundary, 1, 1
boundary, 2, 2
boundary, 3, 3
boundary, 4, 4
boundary, 5, 5
boundary, 6, 6
**
** LOADS
**
** Name: Load-1   Type: Surface traction
*Dsload, follower=YES
loadSurf, TRVEC, 1., 1., 0., 0.
**
** OUTPUT REQUESTS
**
** FIELD OUTPUT: F-Output-1
**
*Output, field, variable=PRESELECT
**
** HISTORY OUTPUT: H-Output-1
**
*Output, history, variable=PRESELECT
*Node output, nset=boundary
RF,
*End Step
** ----------------------------------------------------------------
**
** STEP: Step-5
**
*Step, name=Step-5, nlgeom=YES, unsymm=YES
*Static
0.1, 1., 1e-05, 1.
**
** BOUNDARY CONDITIONS
**
** Name: BC-2 Type: Displacement/Rotation
*Boundary
boundary, 1, 1
boundary, 2, 2
boundary, 3, 3
boundary, 4, 4
boundary, 5, 5, 1.5708
boundary, 6, 6
**
** LOADS
**
** Name: Load-1   Type: Surface traction
*Dsload, follower=YES
loadSurf, TRVEC, 1., 1., 0., 0.
**
** OUTPUT REQUESTS
**
** FIELD OUTPUT: F-Output-1
**
*Output, field, variable=PRESELECT
**
** HISTORY OUTPUT: H-Output-1
**
*Output, history, variable=PRESELECT
*Node output, nset=boundary
RF,
*End Step
** ----------------------------------------------------------------
**
** STEP: Step-6
**
*Step, name=Step-6, nlgeom=YES, unsymm=YES
*Static
0.1, 1., 1e-05, 1.
**
** BOUNDARY CONDITIONS
**
** Name: BC-3 Type: Displacement/Rotation
*Boundary
boundary, 1, 1
boundary, 2, 2
boundary, 3, 3
boundary, 4, 4
boundary, 5, 5
boundary, 6, 6
**
** LOADS
**
** Name: Load-1   Type: Surface traction
*Dsload, follower=YES
loadSurf, TRVEC, 0., 1., 0., 0.
**
** OUTPUT REQUESTS
**
** FIELD OUTPUT: F-Output-1
**
*Output, field, variable=PRESELECT
**
** HISTORY OUTPUT: H-Output-1
**
*Output, history, variable=PRESELECT
*Node output, nset=boundary
RF,
*End Step
** ----------------------------------------------------------------
**
** STEP: Step-7
**
*Step, name=Step-7, nlgeom=YES, unsymm=YES
*Static
0.1, 1., 1e-05, 1.
**
** BOUNDARY CONDITIONS
**
** Name: BC-1 Type: Displacement/Rotation
*Boundary
boundary, 1, 1
boundary, 2, 2
boundary, 3, 3
boundary, 4, 4
boundary, 5, 5
boundary, 6, 6
**
** LOADS
**
** Name: Load-1   Type: Surface traction
*Dsload, follower=NO
loadSurf, TRVEC, 1., 1., 0., 0.
**
** OUTPUT REQUESTS
**
** FIELD OUTPUT: F-Output-1
**
*Output, field, variable=PRESELECT
**
** HISTORY OUTPUT: H-Output-1
**
*Output, history, variable=PRESELECT
*Node output, nset=boundary
RF,
*End Step
** ----------------------------------------------------------------
**
** STEP: Step-8
**
*Step, name=Step-8, nlgeom=YES, unsymm=YES
*Static
0.1, 1., 1e-05, 1.
**
** BOUNDARY CONDITIONS
**
** Name: BC-2 Type: Displacement/Rotation
*Boundary
boundary, 1, 1
boundary, 2, 2
boundary, 3, 3
boundary, 4, 4
boundary, 5, 5, 1.5708
boundary, 6, 6
**
** LOADS
**
** Name: Load-1   Type: Surface traction
*Dsload, follower=NO
loadSurf, TRVEC, 1., 1., 0., 0.
**
** OUTPUT REQUESTS
**
** FIELD OUTPUT: F-Output-1
**
*Output, field, variable=PRESELECT
**
** HISTORY OUTPUT: H-Output-1
**
*Output, history, variable=PRESELECT
*Node output, nset=boundary
RF,
*End Step
** ----------------------------------------------------------------
**
** STEP: Step-9
**
*Step, name=Step-9, nlgeom=YES, unsymm=YES
*Static
0.1, 1., 1e-05, 1.
**
** BOUNDARY CONDITIONS
**
** Name: BC-3 Type: Displacement/Rotation
*Boundary
boundary, 1, 1
boundary, 2, 2
boundary, 3, 3
boundary, 4, 4
boundary, 5, 5
boundary, 6, 6
**
** LOADS
**
** Name: Load-1   Type: Surface traction
*Dsload, follower=NO
loadSurf, TRVEC, 0., 1., 0., 0.
**
** OUTPUT REQUESTS
**
** FIELD OUTPUT: F-Output-1
**
*Output, field, variable=PRESELECT
**
** HISTORY OUTPUT: H-Output-1
**
*Output, history, variable=PRESELECT
*Node output, nset=boundary
RF,
*End Step
** ------------------------------------------------------------
** STEP: Step-10
**
*Step, name=Step-10, nlgeom=YES, unsymm=YES
*Static
0.1, 1., 1e-05, 1.
**
** BOUNDARY CONDITIONS
**
** Name: BC-3 Type: Displacement/Rotation
*Boundary
boundary, 1, 1
boundary, 2, 2
boundary, 3, 3
boundary, 4, 4
boundary, 5, 5
boundary, 6, 6
**
** LOADS
**
** Name: Load-1   Type: Surface traction
*Dsload, follower=NO, CONSTANT RESULTANT=YES
loadSurf, TRVEC, 1., 1., 0., 0.
**
** OUTPUT REQUESTS
**
** FIELD OUTPUT: F-Output-1
**
*Output, field, variable=PRESELECT
**
** HISTORY OUTPUT: H-Output-1
**
*Output, history, variable=PRESELECT
*Node output, nset=boundary
RF,
*restart,write
*End Step
**
** STEP: Step-11
**
*Step, name=Step-11, nlgeom=YES, unsymm=YES
*Static
0.1, 1., 1e-05, 1.
**
** BOUNDARY CONDITIONS
**
** Name: BC-2 Type: Displacement/Rotation
*Boundary
boundary, 1, 1
boundary, 2, 2
boundary, 3, 3
boundary, 4, 4
boundary, 5, 5, 1.5708
boundary, 6, 6
**
** LOADS
**
** Name: Load-1   Type: Surface traction
*Dsload, follower=NO,constant resultant=YES
loadSurf, TRVEC, 1., 1., 0., 0.
**
** OUTPUT REQUESTS
**
** FIELD OUTPUT: F-Output-1
**
*Output, field, variable=PRESELECT
**
** HISTORY OUTPUT: H-Output-1
**
*Output, history, variable=PRESELECT
*Node output, nset=boundary
RF,
*End Step
** ----------------------------------------------------------------
**
** STEP: Step-12
**
*Step, name=Step-12, nlgeom=YES, unsymm=YES
*Static
0.1, 1., 1e-05, 1.
**
** BOUNDARY CONDITIONS
**
** Name: BC-3 Type: Displacement/Rotation
*Boundary
boundary, 1, 1
boundary, 2, 2
boundary, 3, 3
boundary, 4, 4
boundary, 5, 5
boundary, 6, 6
**
** LOADS
**
** Name: Load-1   Type: Surface traction
*Dsload, follower=NO,constant resultant=YES
loadSurf, TRVEC, 0., 1., 0., 0.
**
** OUTPUT REQUESTS
**
** FIELD OUTPUT: F-Output-1
**
*Output, field, variable=PRESELECT
**
** HISTORY OUTPUT: H-Output-1
**
*Output, history, variable=PRESELECT
*Node output, nset=boundary
RF,
*End Step