*Heading
** Job name: Job-1 Model name: Model-1
*Preprint, echo=NO, model=NO, history=NO, contact=NO
**
** PARTS
**
*Part, name=Part-1
*End Part
**
** ASSEMBLY
**
*Assembly, name=Assembly
**
*Instance, name=Part-1-1, part=Part-1
*Node
*Element, type=CPE3
*Node
*Nset, nset=Part-1-1-RefPt_, internal
** Region: (Section-1:Picked)
*Elset, elset=_PickedSet2, internal, generate
** Section: Section-1
*Solid Section, elset=_PickedSet2, material=Material-1
1.,
*End Instance
**
*Instance, name=Part-1-2, part=Part-1
*Node
*Element, type=CPS3
*Node
*Nset, nset=Part-1-2-RefPt_, internal
** Region: (Section-1:Picked)
*Elset, elset=_PickedSet2, internal, generate
** Section: Section-1
*Solid Section, elset=_PickedSet2, material=Material-1
1.,
*End Instance
**
*Instance, name=Part-1-3, part=Part-1
*Node
*Element, type=CPE6
*Node
*Nset, nset=Part-1-3-RefPt_, internal
** Region: (Section-1:Picked)
*Elset, elset=_PickedSet2, internal, generate
** Section: Section-1
*Solid Section, elset=_PickedSet2, material=Material-1
1.,
*End Instance
**
*Instance, name=Part-1-4, part=Part-1
*Node
*Element, type=CPS6
*Node
*Nset, nset=Part-1-4-RefPt_, internal
** Region: (Section-1:Picked)
*Elset, elset=_PickedSet2, internal, generate
** Section: Section-1
*Solid Section, elset=_PickedSet2, material=Material-1
1.,
*End Instance
**
*Instance, name=Part-1-5, part=Part-1
*Node
*Element, type=CPE6M
*Node
*Nset, nset=Part-1-5-RefPt_, internal
** Region: (Section-1:Picked)
*Elset, elset=_PickedSet2, internal, generate
** Section: Section-1
*Solid Section, elset=_PickedSet2, material=Material-1
1.,
*End Instance
**
*Instance, name=Part-1-6, part=Part-1
*Node
*Element, type=CPS6M
*Node
*Nset, nset=Part-1-6-RefPt_, internal
** Region: (Section-1:Picked)
*Elset, elset=_PickedSet2, internal, generate
** Section: Section-1
*Solid Section, elset=_PickedSet2, material=Material-1
1.,
*End Instance
**
*Instance, name=Part-1-7, part=Part-1
*Node
*Element, type=CPE4
*Node
*Nset, nset=Part-1-7-RefPt_, internal
** Region: (Section-1:Picked)
*Elset, elset=_PickedSet2, internal, generate
** Section: Section-1
*Solid Section, elset=_PickedSet2, material=Material-1
1.,
*End Instance
**
*Instance, name=Part-1-8, part=Part-1
*Node
*Element, type=CPS4
*Node
*Nset, nset=Part-1-8-RefPt_, internal
** Region: (Section-1:Picked)
*Elset, elset=_PickedSet2, internal, generate
** Section: Section-1
*Solid Section, elset=_PickedSet2, material=Material-1
1.,
*End Instance
**
*Instance, name=Part-1-9, part=Part-1
*Node
*Element, type=CPE8R
*Node
*Nset, nset=Part-1-9-RefPt_, internal
** Region: (Section-1:Picked)
*Elset, elset=_PickedSet2, internal, generate
** Section: Section-1
*Solid Section, elset=_PickedSet2, material=Material-1
1.,
*End Instance
**
*Instance, name=Part-1-10, part=Part-1
*Node
*Element, type=CPS8R
*Node
*Nset, nset=Part-1-10-RefPt_, internal
** Region: (Section-1:Picked)
*Elset, elset=_PickedSet2, internal, generate
** Section: Section-1
*Solid Section, elset=_PickedSet2, material=Material-1
1.,
*End Instance
*Nset, nset=_PickedSet22, internal, instance=Part-1-1
*Nset, nset=_PickedSet23, internal, instance=Part-1-1
*Nset, nset=_PickedSet24, internal, instance=Part-1-2
*Nset, nset=_PickedSet25, internal, instance=Part-1-2
*Nset, nset=_PickedSet26, internal, instance=Part-1-3
*Nset, nset=_PickedSet27, internal, instance=Part-1-3
*Nset, nset=_PickedSet28, internal, instance=Part-1-4
*Nset, nset=_PickedSet29, internal, instance=Part-1-4
*Nset, nset=_PickedSet30, internal, instance=Part-1-5
*Nset, nset=_PickedSet31, internal, instance=Part-1-5
*Nset, nset=_PickedSet32, internal, instance=Part-1-6
*Nset, nset=_PickedSet33, internal, instance=Part-1-6
*Nset, nset=_PickedSet34, internal, instance=Part-1-7
*Nset, nset=_PickedSet35, internal, instance=Part-1-7
*Nset, nset=_PickedSet36, internal, instance=Part-1-8
*Nset, nset=_PickedSet37, internal, instance=Part-1-8
*Nset, nset=_PickedSet38, internal, instance=Part-1-9
*Nset, nset=_PickedSet39, internal, instance=Part-1-9
*Nset, nset=_PickedSet40, internal, instance=Part-1-10
*Nset, nset=_PickedSet41, internal, instance=Part-1-10
*Nset, nset=boun, instance=Part-1-1
*Nset, nset=boun, instance=Part-1-2
*Nset, nset=boun, instance=Part-1-4
*Nset, nset=boun, instance=Part-1-8
*Nset, nset=boun, instance=Part-1-6
*Nset, nset=boun, instance=Part-1-10
*Nset, nset=boun, instance=Part-1-3
*Nset, nset=boun, instance=Part-1-5
*Nset, nset=boun, instance=Part-1-9
*Nset, nset=boun, instance=Part-1-7
*Elset, elset=_loadSurf_S2, internal, instance=Part-1-1
*Elset, elset=_loadSurf_S2, internal, instance=Part-1-2
*Elset, elset=_loadSurf_S2, internal, instance=Part-1-4
*Elset, elset=_loadSurf_S2, internal, instance=Part-1-8
*Elset, elset=_loadSurf_S2, internal, instance=Part-1-6
*Elset, elset=_loadSurf_S2, internal, instance=Part-1-10
*Elset, elset=_loadSurf_S2, internal, instance=Part-1-3
*Elset, elset=_loadSurf_S2, internal, instance=Part-1-5
*Elset, elset=_loadSurf_S2, internal, instance=Part-1-9
*Elset, elset=_loadSurf_S2, internal, instance=Part-1-7
*Surface, type=ELEMENT, name=loadSurf
_loadSurf_S2, S2
*Surface, type=NODE, name=_PickedSet22_CNS_, internal
_PickedSet22, 1.
*Surface, type=NODE, name=_PickedSet40_CNS_, internal
_PickedSet40, 1.
*Surface, type=NODE, name=_PickedSet24_CNS_, internal
_PickedSet24, 1.
*Surface, type=NODE, name=_PickedSet26_CNS_, internal
_PickedSet26, 1.
*Surface, type=NODE, name=_PickedSet28_CNS_, internal
_PickedSet28, 1.
*Surface, type=NODE, name=_PickedSet30_CNS_, internal
_PickedSet30, 1.
*Surface, type=NODE, name=_PickedSet32_CNS_, internal
_PickedSet32, 1.
*Surface, type=NODE, name=_PickedSet34_CNS_, internal
_PickedSet34, 1.
*Surface, type=NODE, name=_PickedSet36_CNS_, internal
_PickedSet36, 1.
*Surface, type=NODE, name=_PickedSet38_CNS_, internal
_PickedSet38, 1.
** Constraint: Constraint-1
*Coupling, constraint name=Constraint-1, ref node=_PickedSet23, surface=_PickedSet22_CNS_
*Kinematic
1, 1
2, 2
** Constraint: Constraint-10
*Coupling, constraint name=Constraint-10, ref node=_PickedSet41, surface=_PickedSet40_CNS_
*Kinematic
1, 1
2, 2
** Constraint: Constraint-2
*Coupling, constraint name=Constraint-2, ref node=_PickedSet25, surface=_PickedSet24_CNS_
*Kinematic
1, 1
2, 2
** Constraint: Constraint-3
*Coupling, constraint name=Constraint-3, ref node=_PickedSet27, surface=_PickedSet26_CNS_
*Kinematic
1, 1
2, 2
** Constraint: Constraint-4
*Coupling, constraint name=Constraint-4, ref node=_PickedSet29, surface=_PickedSet28_CNS_
*Kinematic
1, 1
2, 2
** Constraint: Constraint-5
*Coupling, constraint name=Constraint-5, ref node=_PickedSet31, surface=_PickedSet30_CNS_
*Kinematic
1, 1
2, 2
** Constraint: Constraint-6
*Coupling, constraint name=Constraint-6, ref node=_PickedSet33, surface=_PickedSet32_CNS_
*Kinematic
1, 1
2, 2
** Constraint: Constraint-7
*Coupling, constraint name=Constraint-7, ref node=_PickedSet35, surface=_PickedSet34_CNS_
*Kinematic
1, 1
2, 2
** Constraint: Constraint-8
*Coupling, constraint name=Constraint-8, ref node=_PickedSet37, surface=_PickedSet36_CNS_
*Kinematic
1, 1
2, 2
** Constraint: Constraint-9
*Coupling, constraint name=Constraint-9, ref node=_PickedSet39, surface=_PickedSet38_CNS_
*Kinematic
1, 1
2, 2
*End Assembly
**
** MATERIALS
**
*Material, name=Material-1
*Elastic
100., 0.3
** ----------------------------------------------------------------
**
** STEP: Step-1
**
*Step, name=Step-1, nlgeom=YES, unsymm=YES
*Static
0.1, 1., 1e-05, 1.
**
** BOUNDARY CONDITIONS
**
** Name: BC-1 Type: Displacement/Rotation
*Boundary
boun, 1, 1
boun, 2, 2
boun, 6, 6
**
** LOADS
**
** Name: Load-1   Type: Surface traction
*Dsload
loadSurf, TRSHR, 1., 0., 1., 0.
**
** OUTPUT REQUESTS
**
*Restart, write, frequency=1
**
** FIELD OUTPUT: F-Output-1
**
*Output, field, variable=PRESELECT
*Output, field
*Element output
 TRSHR
**
** HISTORY OUTPUT: H-Output-1
**
*Output, history, variable=PRESELECT
*Node output, nset=boun
RF,
*End Step
** ----------------------------------------------------------------
**
** STEP: Step-2
**
*Step, name=Step-2, nlgeom=YES, unsymm=YES
*Static
0.1, 1., 1e-05, 1.
**
** BOUNDARY CONDITIONS
**
** Name: BC-1 Type: Displacement/Rotation
*Boundary
boun, 6, 6, 1.507
**
** LOADS
**
** Name: Load-1   Type: Surface traction
*Dsload
loadSurf, TRSHR, 1., 0., 1., 0.
**
** OUTPUT REQUESTS
**
*Restart, write, frequency=1
**
** FIELD OUTPUT: F-Output-1
**
*Output, field, variable=PRESELECT
**
** HISTORY OUTPUT: H-Output-1
**
*Output, history, variable=PRESELECT
*Node output, nset=boun
RF,
*End Step
** ----------------------------------------------------------------
**
** STEP: Step-3
**
*Step, name=Step-3, nlgeom=YES, unsymm=YES
*Static
0.1, 1., 1e-05, 1.
**
** BOUNDARY CONDITIONS
**
** Name: BC-1 Type: Displacement/Rotation
*Boundary
boun, 6, 6
**
** LOADS
**
** Name: Load-1   Type: Surface traction
*Dsload
loadSurf, TRSHR, 0., 0., 1., 0.
**
** OUTPUT REQUESTS
**
*Restart, write, frequency=1
**
** FIELD OUTPUT: F-Output-1
**
*Output, field, variable=PRESELECT
**
** HISTORY OUTPUT: H-Output-1
**
*Output, history, variable=PRESELECT
*Node output, nset=boun
RF,
*End Step
** ----------------------------------------------------------------
**
** STEP: Step-4
**
*Step, name=Step-4, nlgeom=YES, unsymm=YES
*Static
0.1, 1., 1e-05, 1.
**
** BOUNDARY CONDITIONS
**
** Name: BC-1 Type: Displacement/Rotation
*Boundary
boun, 1, 1
boun, 2, 2
boun, 6, 6
**
** LOADS
**
** Name: Load-1   Type: Surface traction
*Dsload
loadSurf, TRVEC, 1., 0., 1., 0.
**
** OUTPUT REQUESTS
**
*Restart, write, frequency=1
**
** FIELD OUTPUT: F-Output-1
**
*Output, field, variable=PRESELECT
*Output, field
*Element output
 TRNOR,TRSHR
**
** HISTORY OUTPUT: H-Output-1
**
*Output, history, variable=PRESELECT
*Node output, nset=boun
RF,
*End Step
** ----------------------------------------------------------------
**
** STEP: Step-5
**
*Step, name=Step-5, nlgeom=YES, unsymm=YES
*Static
0.1, 1., 1e-05, 1.
**
** BOUNDARY CONDITIONS
**
** Name: BC-1 Type: Displacement/Rotation
*Boundary
boun, 6, 6, 1.507
**
** LOADS
**
** Name: Load-1   Type: Surface traction
*Dsload
loadSurf, TRVEC, 1., 0., 1., 0.
**
** OUTPUT REQUESTS
**
*Restart, write, frequency=1
**
** FIELD OUTPUT: F-Output-1
**
*Output, field, variable=PRESELECT
**
** HISTORY OUTPUT: H-Output-1
**
*Output, history, variable=PRESELECT
*Node output, nset=boun
RF,
*End Step
** ----------------------------------------------------------------
**
** STEP: Step-6
**
*Step, name=Step-6, nlgeom=YES, unsymm=YES
*Static
0.1, 1., 1e-05, 1.
**
** BOUNDARY CONDITIONS
**
** Name: BC-1 Type: Displacement/Rotation
*Boundary
boun, 6, 6
**
** LOADS
**
** Name: Load-1   Type: Surface traction
*Dsload
loadSurf, TRVEC, 0., 0., 1., 0.
**
** OUTPUT REQUESTS
**
*Restart, write, frequency=1
**
** FIELD OUTPUT: F-Output-1
**
*Output, field, variable=PRESELECT
**
** HISTORY OUTPUT: H-Output-1
**
*Output, history, variable=PRESELECT
*Node output, nset=boun
RF,
*End Step
** ----------------------------------------------------------------
**
** STEP: Step-7
**
*Step, name=Step-7, nlgeom=YES, unsymm=YES
*Static
0.1, 1., 1e-05, 1.
**
** BOUNDARY CONDITIONS
**
** Name: BC-1 Type: Displacement/Rotation
*Boundary
boun, 1, 1
boun, 2, 2
boun, 6, 6
**
** LOADS
**
** Name: Load-1   Type: Surface traction
*Dsload,follower=no
loadSurf, TRVEC, 1., 0., 1., 0.
**
** OUTPUT REQUESTS
**
*Restart, write, frequency=1
**
** FIELD OUTPUT: F-Output-1
**
*Output, field, variable=PRESELECT
**
** HISTORY OUTPUT: H-Output-1
**
*Output, history, variable=PRESELECT
*Node output, nset=boun
RF,
*End Step
** ----------------------------------------------------------------
**
** STEP: Step-8
**
*Step, name=Step-8, nlgeom=YES, unsymm=YES
*Static
0.1, 1., 1e-05, 1.
**
** BOUNDARY CONDITIONS
**
** Name: BC-1 Type: Displacement/Rotation
*Boundary
boun, 6, 6, 1.507
**
** LOADS
**
** Name: Load-1   Type: Surface traction
*Dsload,follower=no
loadSurf, TRVEC, 1., 0., 1., 0.
**
** OUTPUT REQUESTS
**
*Restart, write, frequency=1
**
** FIELD OUTPUT: F-Output-1
**
*Output, field, variable=PRESELECT
**
** HISTORY OUTPUT: H-Output-1
**
*Output, history, variable=PRESELECT
*Node output, nset=boun
RF,
*End Step
** ----------------------------------------------------------------
**
** STEP: Step-9
**
*Step, name=Step-9, nlgeom=YES, unsymm=YES
*Static
0.1, 1., 1e-05, 1.
**
** BOUNDARY CONDITIONS
**
** Name: BC-1 Type: Displacement/Rotation
*Boundary
boun, 6, 6
**
** LOADS
**
** Name: Load-1   Type: Surface traction
*Dsload,follower=no
loadSurf, TRVEC, 0., 0., 1., 0.
**
** OUTPUT REQUESTS
**
*Restart, write, frequency=1
**
** FIELD OUTPUT: F-Output-1
**
*Output, field, variable=PRESELECT
**
** HISTORY OUTPUT: H-Output-1
**
*Output, history, variable=PRESELECT
*Node output, nset=boun
RF,
*End Step
** ----------------------------------------------------------------
**
** STEP: Step-10
**
*Step, name=Step-10, nlgeom=YES, unsymm=YES
*Static
0.1, 1., 1e-05, 1.
**
** BOUNDARY CONDITIONS
**
** Name: BC-1 Type: Displacement/Rotation
*Boundary
boun, 1, 1
boun, 2, 2
boun, 6, 6
**
** LOADS
**
** Name: Load-1   Type: Surface traction
*Dsload,follower=no,constant resultant=yes
loadSurf, TRVEC, 1., 0., 1., 0.
**
** OUTPUT REQUESTS
**
*Restart, write, frequency=1
**
** FIELD OUTPUT: F-Output-1
**
*Output, field, variable=PRESELECT
**
** HISTORY OUTPUT: H-Output-1
**
*Output, history, variable=PRESELECT
*Node output, nset=boun
RF,
*End Step
** ----------------------------------------------------------------
**
** STEP: Step-11
**
*Step, name=Step-11, nlgeom=YES, unsymm=YES
*Static
0.1, 1., 1e-05, 1.
**
** BOUNDARY CONDITIONS
**
** Name: BC-1 Type: Displacement/Rotation
*Boundary
boun, 6, 6, 1.507
**
** LOADS
**
** Name: Load-1   Type: Surface traction
*Dsload,follower=no,constant resultant=yes
loadSurf, TRVEC, 1., 0., 1., 0.
**
** OUTPUT REQUESTS
**
*Restart, write, frequency=1
**
** FIELD OUTPUT: F-Output-1
**
*Output, field, variable=PRESELECT
**
** HISTORY OUTPUT: H-Output-1
**
*Output, history, variable=PRESELECT
*Node output, nset=boun
RF,
*End Step
** ----------------------------------------------------------------
**
** STEP: Step-12
**
*Step, name=Step-12, nlgeom=YES, unsymm=YES
*Static
0.1, 1., 1e-05, 1.
**
** BOUNDARY CONDITIONS
**
** Name: BC-1 Type: Displacement/Rotation
*Boundary
boun, 6, 6
**
** LOADS
**
** Name: Load-1   Type: Surface traction
*Dsload,follower=no,constant resultant=yes
loadSurf, TRVEC, 0., 0., 1., 0.
**
** OUTPUT REQUESTS
**
*Restart, write, frequency=1
**
** FIELD OUTPUT: F-Output-1
**
*Output, field, variable=PRESELECT
**
** HISTORY OUTPUT: H-Output-1
**
*Output, history, variable=PRESELECT
*Node output, nset=boun
RF,
*End Step