*Heading
** test traction load in a cylindrical system
*Preprint, echo=NO, model=NO, history=NO, contact=NO
**
** PARTS
**
*Part, name=Part-1
*End Part
**
**
** ASSEMBLY
**
*Assembly, name=Assembly
**
*Instance, name=Part-1-1, part=Part-1
*Node
*Element, type=C3D8R
*Node
*Nset, nset=Part-1-1-RefPt_, internal
** Region: (Section-1:Picked), (Controls:EC-1)
*Elset, elset=_PickedSet3, internal, generate
** Section: Section-1
*Solid Section, elset=_PickedSet3, material=Material-1
1.,
*End Instance
**
*Nset, nset=_PickedSet5, internal, instance=Part-1-1
*Nset, nset=_PickedSet12, internal, instance=Part-1-1
*Elset, elset=__PickedSurf4_S2, internal, instance=Part-1-1, generate
*Surface, type=ELEMENT, name=_PickedSurf4, internal
__PickedSurf4_S2, S2
*Elset, elset=_Surf-1_S3, internal, instance=Part-1-1
*Elset, elset=_Surf-1_S4, internal, instance=Part-1-1
*Surface, type=ELEMENT, name=Surf-1
_Surf-1_S3, S3
_Surf-1_S4, S4
*Orientation, name=cylori, system=CYLINDRICAL
** Constraint: Constraint-1
*Coupling, constraint name=Constraint-1, ref node=_PickedSet5, surface=_PickedSurf4
*Kinematic
1, 1
2, 2
3, 3
*End Assembly
**
** ELEMENT CONTROLS
**
**Section Controls, name=EC-1, hourglass=ENHANCED
**1., 1., 1.
*Amplitude, name=Amp-1
0., 0., 1., 1.
**
** MATERIALS
**
*Material, name=Material-1
*Density
 0.0001,
*Elastic
1000,0.3
** ----------------------------------------------------------------
**
** STEP: Step-1
**
*Step, name=Step-1
*Dynamic, Explicit
, 0.35
*Bulk Viscosity
**
** BOUNDARY CONDITIONS
**
** Name: BC-1 Type: Displacement/Rotation
*Boundary
_PickedSet12, 1, 1
_PickedSet12, 2, 2
_PickedSet12, 3, 3
_PickedSet12, 4, 4
_PickedSet12, 5, 5
_PickedSet12, 6, 6
**
** LOADS
**
** Name: Load-1   Type: Surface traction
*Dsload, amplitude=Amp-1, orientation=Assembly.cylori
Surf-1, trvec, .2, 0., 1., 0.
**
** OUTPUT REQUESTS
**
*Restart, write, number interval=1, time marks=NO
**
** FIELD OUTPUT: F-Output-1
**
*Output, field, number=1
*Element output
TRNOR,TRSHR
*Node output
U,
**
*End Step