*NODE,NSET=RIGID-ROAD
******
******
******
*ELEMENT,TYPE=M3D4,ELSET=roadshell
*ELGEN, ELSET=roadshell
*MEMBRANE SECTION, MATERIAL=dummy100, ELSET=roadshell
1.0
*MATERIAL,NAME=dummy100
*ELASTIC
10
*DENSITY
1.0
*RIGID BODY,REF NODE=9999999,ELSET=roadshell
*BOUNDARY
9999999,1,6
**