*HEADING
 SYMMETRIC RESULTS TRANSFER FOR TIRE MODEL
 TIRETRANSFER_AXI_HALF
 AXISYMMETRIC HALF TIRE MODEL
 STEP 1: INFLATE TIRE TO 200 KPA
 UNITS: KG, M
*RESTART,WRITE,FREQ=100
*NODE,NSET=NTIRE,INP=tiretransfer_node.inp
*NODE,NSET=RIM
*ELEMENT,TYPE=CGAX4H,ELSET=TREAD
*ELEMENT,TYPE=CGAX3H,ELSET=TREAD
*ELEMENT,TYPE=CGAX4H,ELSET=SIDE
*ELEMENT,TYPE=CGAX4H,ELSET=BELT
*RIGID BODY, TIE NSET=RIMNOD, REFNODE=RIM
*ELSET,ELSET=CARCASS
SIDE,BELT
*ELEMENT,TYPE=SFMGAX1,ELSET=MEM_BELT1
*ELEMENT,TYPE=SFMGAX1,ELSET=MEM_BELT2
*ELEMENT,TYPE=SFMGAX1,ELSET=MEM_CARCASS
*EMBEDDED ELEMENT,HOST=CARCASS,ROUNDOFF TOL=5.E-4
MEM_CARCASS,
*EMBEDDED ELEMENT,HOST=BELT,ROUNDOFF TOL=5.E-4
MEM_BELT1,MEM_BELT2
*SURFACE SECTION,ELSET=MEM_BELT1
*REBAR LAYER
 BELT1, 0.2118683E-6, 1.16E-3, 0.0, BELT, 70.0
*SURFACE SECTION,ELSET=MEM_BELT2
*REBAR LAYER
 BELT2, 0.2118683E-6, 1.16E-3, 0.0, BELT, 110.0
*SURFACE SECTION,ELSET=MEM_CARCASS
*REBAR LAYER
 CARCASS, 0.4208352E-6, 1.00E-3, 0.0, CARCASS, 0.0
*SOLID SECTION,ELSET=TREAD,MATERIAL=RUBBER
*SOLID SECTION,ELSET=SIDE,MATERIAL=RUBBER
*SOLID SECTION,ELSET=BELT,MATERIAL=RUBBER
*MATERIAL,NAME=RUBBER
*HYPERELASTIC,N=1,MODULI=LONG TERM
 1.0E6,
*VISCOELASTIC,TIME=PRONY
 0.3, 0.0, 0.1
*DENSITY
 1100.,
*MATERIAL,NAME=BELT
*ELASTIC,TYPE=ISO
 172.2E+09, 0.3
*DENSITY
 5900.,
*MATERIAL,NAME=CARCASS
*ELASTIC,TYPE=ISO
 9.87E+9,  0.3
*DENSITY
 1500.,
*NSET,NSET=RIMNOD
*NSET,NSET=SYM
*ELSET,ELSET=SOLID,GENERATE
*SURFACE,NAME=INSIDE
 BELT, S3
 SIDE, S3
***********************************
*STEP,NLGEOM=YES
 1:  INFLATION
*STATIC, LONG TERM
 0.25, 1.0
*BOUNDARY
 RIM, 1, 2
 RIM, 5, 6
 SYM, 2,
 SYM, 5,
*DSLOAD
 INSIDE, P, 200.E3
*NODE PRINT,FREQ=0
*EL PRINT,FREQ=0
*OUTPUT,FIELD,FREQ=1
*ELEMENT OUTPUT
S,LE
*ELEMENT OUTPUT,REBAR
S,LE
*NODE OUTPUT
U,
*OUTPUT,HISTORY,VARIABLE=PRESELECT,FREQ=1
*ELEMENT OUTPUT,REBAR,ELSET=MEM_BELT1
S,
*NODE OUTPUT,NSET=RIM
RF,
*END STEP