*HEADING
 STEADY STATE FREQUENCY RESPONSE OF TIRE: TIREDYNAMIC_AXI_HALF
 AXISYMMETRIC HALF TIRE MODEL
 STEP 1: INFLATE TIRE TO 200 KPa
 UNITS: KG, M
*RESTART,WRITE,FREQ=100
*NODE,NSET=NTIRE,INP=tiretransfer_node.inp
*ELEMENT,TYPE=CGAX4H,ELSET=TREAD
*ELEMENT,TYPE=CGAX3H,ELSET=TREAD
*ELEMENT,TYPE=CGAX4H,ELSET=SIDE
*ELEMENT,TYPE=CGAX4H,ELSET=BELT
*REBAR,ELEMENT=CONTINUUM,MATERIAL=BELT,GEOMETRY=ISO,NAME=BELT1
 BELT, 0.2118683E-6, 1.16E-3,  70.0, 0.50,  3
*REBAR,ELEMENT=CONTINUUM,MATERIAL=BELT,GEOMETRY=ISO,NAME=BELT2
 BELT, 0.2118683E-6, 1.16E-3, 110.0, 0.83,  3
*REBAR,ELEMENT=CONTINUUM,MATERIAL=CARCASS,GEOMETRY=ISO,NAME=CARCASS
 BELT, 0.4208352E-6, 1.00E-3, 0.0, 0.0,  3
 SIDE, 0.4208352E-6, 1.00E-3, 0.0, 0.0,  3
*SOLID SECTION,ELSET=TREAD,MATERIAL=RUBBER
*SOLID SECTION,ELSET=SIDE,MATERIAL=RUBBER
*SOLID SECTION,ELSET=BELT,MATERIAL=RUBBER
*MATERIAL,NAME=RUBBER
*HYPERELASTIC,N=1,MODULI=LONG TERM
 1.0e6,
*VISCOELASTIC,FREQUENCY=PRONY
 0.3, 0.0, 0.1
*DENSITY
 1100.,
*MATERIAL,NAME=BELT
*ELASTIC,TYPE=ISO
 172.2E+09, 0.3
*DENSITY
 5900.,
*MATERIAL,NAME=CARCASS
*ELASTIC,TYPE=ISO
 9.87E+9,  0.3
*DENSITY
 1500.,
*NSET,NSET=RIM
*NSET,NSET=SYM
*ELSET,ELSET=SOLID,GENERATE
*SURFACE,NAME=INSIDE
 BELT, S3
 SIDE, S3
**************************************************
*STEP,NLGEOM=YES
 1:  INFLATION
*STATIC
 0.25, 1.0
*BOUNDARY
 RIM, 1, 2
 RIM, 5,
 SYM, 2,
 SYM, 5,
*DSLOAD
 INSIDE, P, 200.E3
*OUTPUT,FIELD,VARIABLE=PRESELECT,FREQ=1
*OUTPUT,HISTORY,FREQ=1
*END STEP