*HEADING
TEMPERATURE DEPENDENT FILM CONDITION, EXPLICIT [CPS3T]
**
** See ch. 1.3.37 of ABAQUS/Verification Manual
**
*RESTART,WRITE, NUM=10
*NODE
*NGEN,NSET=NALL
*ELEMENT,TYPE=CPS3T
*ELGEN,ELSET=EALLA
*ELGEN,ELSET=EALLB
*ELSET,ELSET=EALL
EALLA,EALLB
*SOLID SECTION,ELSET=EALL,MATERIAL=MAT
*MATERIAL,NAME=MAT
*ELASTIC
1.0,0.0
*EXPANSION
0.0,
*CONDUCTIVITY
1.40,
*SPECIFIC HEAT
260.0,
*DENSITY
7800.0,
*FILM PROPERTY,NAME=FILMP
*AMPLITUDE,NAME=SINK
0.0,100.0, 3600.0,200.0
*INITIAL CONDITIONS,TYPE=TEMPERATURE
NALL,0.0
*STEP
*DYNAMIC TEMPERATURE-DISPLACEMENT, EXPLICIT
*FILM,AMP=SINK
20,F2,1.0,FILMP
*DFLUX
EALLA,S2,0.0
EALLB,S3,0.0
1,S1,0.0
****************************
*FILE OUTPUT, NUM=1
*NODE FILE, NSET=NALL
NT,
****************************
*OUTPUT,FIELD,NUM=1
*NODE OUTPUT,NSET=NALL
NT,
****************************
***OUTPUT,HISTORY,TIME INTERVAL=360
***NODE OUTPUT,NSET=NALL
**NT,
****
*OUTPUT,HISTORY,TIME INTERVAL=3600
*ENERGY OUTPUT,VAR=ALL
****************************
*ENDSTEP