*HEADING
 Test import capability with FeFp: Standard to Explicit
 Element:  CPS4R + orientation
 Material: marlow + plasticity + mullins
 Base for file: sx_x_fefp2d_biori.inp
*NODE,NSET=ALL
*NSET,NSET=y0
*NSET,NSET=y1
*NSET,NSET=x0
*NSET,NSET=x1
**
*ELEMENT,TYPE=CPS4R,ELSET=Solid
*ELSET,ELSET=EALL
 SOLID
*orientation, name=ori1
*solid section, elset=solid, material=mat-129, ori=ori1
 1.
**---------------------------------------------
*MATERIAL,NAME=mat-129
*DENSITY
1.e-6
*HYPERELASTIC,marlow,poisson=0.495
**
** Output: uniaxial loading
**
*uniaxial Test Data
*Mullins effect, Test Data Input
**
** Output: uniaxial mullins
**
*uniaxial Test Data
*uniaxial Test Data
**
** Output: Hardening data
**
*Plastic
0.19668078,  0
2.9532671, 0.012512393
9.5576679, 0.044332625
92.370193, 0.44332625
**---------------------------------------------
*amplitude,name=nominal_strain
0.0, 0.0, 0.25, 1.0, 0.5, 0., 0.75, 1.
1.0, 1.2
*STEP,nlgeom=yes,inc=10000
*static
 0.025,1.,,0.025
*BOUNDARY,type=velocity
 y0,2,2
 x0,1,1
*boundary, amplitude=nominal_strain
 x1,1,1,0.4
 y1,2,2,0.2
*restart,write,freq=5
*output,field,freq=5
*node output
 u,
 RF
*element output
 S
 PEEQ
 E
*output,history
*element output,elset=solid
 s11,
 s22,
 LE11
*END STEP
**