*HEADING
DRUCKER-PRAGER/LINEAR ELASTICITY, SHEAR CRITERION=EXP, BIAXIAL TENSION, 3D
*PREPRINT,MODEL=YES
*RESTART,WRITE
*NODE,NSET=ALL
**
**
*NSET,NSET=FACE1
*NSET,NSET=FACE2
*NSET,NSET=FACE3
*NSET,NSET=FACE4
*NSET,NSET=FACE5
*NSET,NSET=FACE6
*ELEMENT,TYPE=C3D8R,ELSET=LIN
*ELEMENT,TYPE=C3D8R,ELSET=HYP
*ELEMENT,TYPE=C3D8R,ELSET=EXP
*ELSET, ELSET=ALLE
 LIN,HYP,EXP
*SOLID SECTION,ELSET=LIN,MATERIAL=DPLIN
*SOLID SECTION,ELSET=HYP,MATERIAL=DPHYP
*SOLID SECTION,ELSET=EXP,MATERIAL=DPEXP
**
*MATERIAL,NAME=DPLIN
*DENSITY
1.0E-2
*ELASTIC
300.E3,.3
*DRUCKER PRAGER
*DRUCKER PRAGER HARDENING
**
*MATERIAL,NAME=DPHYP
*DENSITY
1.0E-2
*ELASTIC
300.E3,.3
*DRUCKER PRAGER,SHEAR CRITERION=HYPERBOLIC
*DRUCKER PRAGER HARDENING
**
*MATERIAL,NAME=DPEXP
*DENSITY
1.0E-2
*ELASTIC
300.E3,.3
*DRUCKER PRAGER,SHEAR CRITERION=EXPONENT
*DRUCKER PRAGER HARDENING
**
*STEP,NLGEOM,INC=20
UNIAXIAL TENSION
*STATIC
0.1,1.
*BOUNDARY,OP=NEW
FACE1,3
FACE3,2
FACE6,1
FACE4,1,1,.02
*EL PRINT,F=10
S,
E,
PEEQ,
*NODE PRINT,F=10
U,RF
*OUTPUT,FIELD,FREQ=10
*NODE OUTPUT
U,RF
*ELEMENT OUTPUT
S,PEEQ,PE
*OUTPUT,HISTORY
*ELEMENT OUTPUT,ELSET=ALLE
S,PEEQ,PE,PENER
*END STEP