*HEADING
Import S2X: standard job, c3d8r
simple shear with orientation
*restart,write,freq=10
*NODE,NSET=one
*NSET,NSET=FACE1
*NSET,NSET=FACE2
*NSET,NSET=FACE3
*NSET,NSET=FACE4
*NSET,NSET=FACE5
*NSET,NSET=FACE6
*ELEMENT,TYPE=C3D8r,ELSET=ONE
*orientation, name=ori1
*SOLID SECTION,ELSET=ONE,MATERIAL=mat-129,ori=ori1
*MATERIAL,NAME=mat-129
*HYPERELASTIC,marlow,poisson=0.475
*include, input=heplmu_matprops_uni.inp
*density
1.e-6
*amplitude,name=nominal_strain
0.0,0.0, 10.,0.3, 20.,0.0, 40.,0.6,
50.,0.0, 70.,1.0
*STEP,NLGEOM,INC=2000
*STATIC
0.5,70.,,0.5
*BOUNDARY
FACE6,1,3
FACE4,1,2
*boundary, amplitude=nominal_strain
face4,3,3,1.0
*output,field,freq=10
*node output
u
*output,history,freq=1
*node output,nset=FACE6
rf
*node output,nset=FACE4
u
*END STEP