*HEADING
Standard: Submodel Dynamic analysis [CAX4R] from
an Explicit Global Dynamic submodelaxielem_cax4r_gd_xpl
***
***
*NODE,NSET=NALL
*NGEN,NSET=NL
*NGEN,NSET=NR
*NSET,NSET=QA_TEST
NR,
*NFILL,NSET=NALL
NL,NR,6,100
*ELEMENT,TYPE=CAX4R,ELSET=EALL
*ELGEN,ELSET=EALL
*SOLID SECTION,MATERIAL=MAT1,ELSET=EALL
1.,
*MATERIAL,NAME=MAT1
*DENSITY
10,
*ELASTIC
30.E6,0.3
*ELSET,ELSET=LOAD
*ELSET,ELSET=CENTER
*NSET,NSET=ENDS
NL,NR
*SUBMODEL
NL,
*AMPLITUDE,NAME=RAMP,DEF=SMOOTH STEP
0,0,0.04,1
*STEP
*DYNAMIC, EXPLICIT
 ,0.04
*BOUNDARY,SUBMODEL,STEP=1
NL,1,2
*DLOAD,OP=MOD,AMP=RAMP
LOAD,P2,-1000000.
**************
*OUTPUT, FIELD, NUMBER INTERVAL = 1
*NODE OUTPUT,NSET=QA_TEST
 U,
*OUTPUT, HISTORY, TIME INT=0.04
*ENERGY OUTPUT,VAR=ALL
*****************
*OUTPUT, HISTORY, TIME INT=0.002
*NODE OUTPUT,NSET=NR
U,
*****************
*OUTPUT, FIELD, NUMBER INTERVAL = 4
*ELEMENT OUTPUT, ELSET=EALL
 S,
*NODE OUTPUT
 U,
****************
*END STEP