*HEADING
ABAQUS/Explicit Submodel analysis [CAX6MT]
*NODE,NSET=ALL
*NGEN,NSET=NL
*NGEN,NSET=NR
*NSET,NSET=QA_TEST
NR,
*NFILL,NSET=ALL
NL,NR,8,10
*NSET,NSET=FIX1,GEN
**1,81,10
*NSET,NSET=FIX2,GEN
*NSET,NSET=FIX3,GEN
*NSET,NSET=FIX4,GEN
*NSET,NSET=NALL
FIX1,FIX2,FIX3,FIX4
*SUBMODEL,ABSOLUTE EXTERIOR TOLERANCE=0.1
NALL,
*ELEMENT, TYPE=CAX6MT, ELSET=EALL
*ELGEN,ELSET=EALL
*ELSET,ELSET=EFLUX2
*SOLID SECTION,MATERIAL=COPPER, ELSET=EALL
*********Copper material******
*MATERIAL,NAME=COPPER
*ELASTIC
 110.E9, .3
*EXPANSION
1e-3,
*CONDUCTIVITY
 390,
*SPECIFIC HEAT
 384,
*DENSITY
 8900,
*RESTART,WRITE
*STEP
*DYNAMIC TEMPERATURE-DISPLACEMENT,EXPLICIT
*FIXED MASS SCALING,FACTOR=1e14
*BOUNDARY
FIX1, 2
*BOUNDARY,SUBMODEL,STEP=1
FIX3,1,2
FIX3,11,11
FIX4,1,2
FIX4,11,11
*DFLUX,OP=NEW
 EFLUX2, S2, 0.2e4
*****************
*FILE OUTPUT,NUMBER INTERVAL=1
*NODE FILE
NT,U
**************
*OUTPUT, FIELD, NUMBER INTERVAL = 1
*NODE OUTPUT,NSET=QA_TEST
NT
*OUTPUT, HISTORY, TIME INT=2.0e6
*ENERGY OUTPUT,VAR=ALL
*****************
*OUTPUT, HISTORY, TIME INT=2e5
*NODE OUTPUT,NSET=NALL
U,NT11
*****************
*OUTPUT, FIELD, NUMBER INTERVAL = 4
*ELEMENT OUTPUT, ELSET=EALL
 S,
*NODE OUTPUT
 U,NT
****************
*END STEP