*HEADING
ABAQUS/Explicit
Global analysis: [CPS6MT]
*NODE,NSET=ALL
*NGEN,NSET=NL
*NGEN,NSET=NR
*NFILL,NSET=ALL
NL,NR,8,10
*NSET,NSET=FIX1,GEN
*NSET,NSET=FIX2,GEN
*NSET,NSET=FIX3,GEN
*NSET,NSET=FIX4,GEN
*NSET,NSET=NALL
FIX1,FIX2,FIX3,FIX4
*NSET,NSET=QA_TEST
NR,
*ELEMENT, TYPE=CPS6MT, ELSET=EALL
*ELGEN,ELSET=EALL
*ELSET,ELSET=EFLUX2
*SOLID SECTION,MATERIAL=COPPER, ELSET=EALL
*********Copper material******
*MATERIAL,NAME=COPPER
*ELASTIC
 110.E9, .3
*EXPANSION
1e-3,
*CONDUCTIVITY
 390,
*SPECIFIC HEAT
 384,
*DENSITY
 8900,
*RESTART,WRITE,OVERLAY
*****************************************
*STEP
*DYNAMIC TEMPERATURE-DISPLACEMENT,EXPLICIT
*FIXED MASS SCALING,FACTOR=1e14
*BOUNDARY, OP=NEW
 FIX1,  2
 FIX4,  1
 FIX4, 11
*DFLUX,OP=NEW
 EFLUX2, S2, 0.2e4
***********************************
***    DO NOT MODIFY THE GLOBAL ***
***          FIL REQUEST     ******
***********************************
*FILE OUTPUT,NUMBER INTERVAL=20
*NODE FILE
NT,U
*EL FILE
TEMP
**************
*OUTPUT, FIELD, NUMBER INTERVAL = 1
*NODE OUTPUT,NSET=QA_TEST
NT
*OUTPUT, HISTORY, TIME INT=2.0e6
*ENERGY OUTPUT,VAR=ALL
*****************
*OUTPUT, HISTORY, TIME INT=2.0e5
*NODE OUTPUT,NSET=NALL
U,NT11
*****************
*OUTPUT, FIELD, NUMBER INTERVAL = 4
*ELEMENT OUTPUT, ELSET=EALL
 S,
*NODE OUTPUT
 U,NT
****************
*END STEP