*Heading
 submodel analysis using C3D8 elements abd driven displacement
** Job name: subm_intonly_g_c3d8_std Model name: Model-1
** Generated by: Abaqus/CAE 6.10-DEV
*Preprint, echo=NO, model=NO, history=NO, contact=NO
**
** PARTS
**
*Part, name=Part-1
*Node
*Element, type=C3D8R
*Nset, nset=_PickedSet2, internal, generate
*Elset, elset=_PickedSet2, internal, generate
** Section: Section-1
*Solid Section, elset=_PickedSet2, material=Al
*End Part
**
**
** ASSEMBLY
**
*Assembly, name=Assembly
**
*Instance, name=Part-1-1, part=Part-1
*End Instance
**
*Nset, nset=NALL, internal, instance=Part-1-1, generate
*Nset, nset=_PickedSet4, internal, instance=Part-1-1, generate
*Elset, elset=_PickedSet4, internal, instance=Part-1-1, generate
*Nset, nset=_PickedSet5, internal, instance=Part-1-1
*Elset, elset=__PickedSurf6_S2, internal, instance=Part-1-1, generate
*Surface, type=ELEMENT, name=_PickedSurf6, internal
__PickedSurf6_S2, S2
*submodel, intersection only
nall,
*End Assembly
**
** MATERIALS
**
*Material, name=Al
*Density
2780.,
*Elastic
 3e+07, 0.3
**
** STEP: Step-1
**
*Step, name=Step-1
test
*dynamic, explicit
 ,0.1
*Boundary, submodel, step=1
nall, 1,3
**
** OUTPUT REQUESTS
**
*Restart, write, number interval=9999
**
** FIELD OUTPUT: F-Output-1
**
*Output, field, variable=PRESELECT
**
** HISTORY OUTPUT: H-Output-1
**
*Output, history, variable=PRESELECT
*End Step