HEADING
MEMBRANE PATCH TEST  [CPE6MT]
u1=C01+C11x+C21y;u2=C02+C12x+C22y;
C01=C02=0,C11=C22=1e-3,C12=C21=0.5E-3;
*PREPRINT,ECHO=YES,HISTORY=NO,MODEL=NO
*NODE
*NGEN, NSET=NALL
*ELEMENT,TYPE=CPE6MT, ELSET=EALL
*ELSET,ELSET=EL3
*SOLID SECTION,MATERIAL=A1, ELSET=EALL
.001,
*MATERIAL,NAME=A1
*ELASTIC,TYPE=ISOTROPIC
1.E6,.25
*EXPANSION
0.0,
*CONDUCTIVITY
4.85E-4,
*DENSITY
100.0,
*SPECIFIC HEAT
.116,
*NSET,NSET=SIDES,GENERATE
*AMPLITUDE, NAME=RAMP
0,0,1., 1.0
**
**
*ELSET,ELSET=QA_TEST_ALLELEMS
EALL,
**
*NSET, NSET=QA_TEST_ALLNODES
NALL,
*STEP
*DYNAMIC TEMPERATURE-DISPLACEMENT, EXPLICIT
*BOUNDARY,TYPE=VELOCITY
10,1,2
20,1,,.24E-3
20,2,,.12E-3
30,1,,.3E-3
30,2,,.24E-3
40,1,,.06E-3
40,2,,.12E-3
50,1,,.12E-3
*******************************
*FILE OUTPUT, NUM=1
*EL FILE
 S,
 LE,
*NODE FILE
 U,
**************************
*OUTPUT, FIELD,NUMBER INTERVAL=1
*ELEMENT OUTPUT, ELSET=EALL
 S,
*********************************
*OUTPUT, FIELD, NUMBER INTERVAL=1
*ELEMENT OUTPUT, ELSET=QA_TEST_ALLELEMS
 LE,
*NODE OUTPUT, NSET=QA_TEST_ALLNODES
 U,
*OUTPUT,HISTORY,VARIABLE=PRESELECT,TIMEINT=1
************************************
**
*END STEP
**
**
*STEP
*DYNAMIC TEMPERATURE-DISPLACEMENT, EXPLICIT
*BOUNDARY, TYPE=VELOCITY
10,1,2
20,1,,-.24E-3
20,2,,-.12E-3
30,1,,-.3E-3
30,2,,-.24E-3
40,1,,-.06E-3
40,2,,-.12E-3
50,1,,-.12E-3
*ENDSTEP
**
**
*STEP
*DYNAMIC TEMPERATURE-DISPLACEMENT, EXPLICIT
*DLOAD, AMP=RAMP
1, P3, -10000.
2, P1, -10000.
4, P2, -10000.
10, P2, -10000.
*BOUNDARY, OP=NEW, TYPE=VELOCITY
10,1,2
20,2,2
*END STEP
**
**
*STEP
*DYNAMIC TEMPERATURE-DISPLACEMENT, EXPLICIT
*BOUNDARY, TYPE=VELOCITY
10,1,2
20,1,,.24E-3
20,2,,.12E-3
30,1,,.3E-3
30,2,,.24E-3
40,1,,.06E-3
40,2,,.12E-3
50,1,,.12E-3
*END STEP