*HEADING
 Transfer from Standard to Standard : elastic
 - Second Standard analysis
 - Reference solution to ss1_sax1_ep_n_n
*IMPORT,UPDATE=YES,STATE=NO,STEP=1
EALLA, EALLB
*RESTART, WRITE
*FILE FORMAT,ZERO INC
*NODE,NSET=ALL1
*NSET,NSET=DISP2
*ELEMENT,TYPE=SAX1,ELSET=EALL1
*SHELL SECTION,ELSET=EALL1,MATERIAL=MAT2
0.1,
*MATERIAL,NAME=MAT2
*ELASTIC
200.E9,0.3
*PLASTIC
300.E8,0.0
350.E8,0.1
*STEP,NLGEOM
*STATIC
.1,1.
*BOUNDARY, TYPE=VELOCITY
1, 1,2
1, 6,6
11,1,2
11,6,6
21,1,2
21,6,6
2, 2,2
12,2,2
DISP, 1,1
DISP1,1,1,0.1
DISP2,1,1,0.2
*NODE FILE
COORD,
*EL FILE
S,
EE,
LE,
PE,
STH,
*OUTPUT,FIELD
*ELEMENT OUTPUT
S,
EE,
PE,
STH,
*NODE OUTPUT
COORD
*END STEP