*HEADING
 Transfer from Standard to Standard: elastic+plastic
 - First Standard analysis
*preprint,model=yes
*RESTART,WRITE
*NODE,NSET=ALL
*NSET,NSET=DISP
*NSET,NSET=DISP1
**
*NSET,NSET=YZPLANE1
*NSET,NSET=YZPLANE2
*NSET,NSET=YZPLANE
YZPLANE1,YZPLANE2
**
*NSET,NSET=XZPLANE1
*NSET,NSET=XZPLANE2
*NSET,NSET=XZPLANE
XZPLANE1,XZPLANE2
**
*NSET,NSET=XYPLANE1
*NSET,NSET=XYPLANE2
*NSET,NSET=XYPLANE
XYPLANE1,XYPLANE2
**
*ELEMENT,TYPE=C3D8,ELSET=EALL
*DISTRIBUTION TABLE, NAME=DISTTABLEORI
 COORD3D, COORD3D
*DISTRIBUTION, NAME=DISTORI, TABLE=DISTTABLEORI, LOCATION=ELEMENT
 EALL, 1.,1.,1., -1.,1.,1.
*DISTRIBUTION TABLE, NAME=DISTTABLEORIANGLE
 ANGLE
*DISTRIBUTION, NAME=DISTORIANGLE, TABLE=DISTTABLEORIANGLE, LOCATION=ELEMENT
 EALL, 0.
*ORIENTATION, NAME=ORI
 DISTORI
 3, DISTORIANGLE
*SOLID SECTION,ELSET=EALL,MATERIAL=MAT1, ORIENTATION=ORI
1.0,
*DISTRIBUTION TABLE, NAME=DIST_TABLE_ORTHO
 MODULUS, MODULUS, MODULUS, MODULUS, MODULUS, MODULUS, MODULUS
 MODULUS, MODULUS
*DISTRIBUTION, NAME=DISTORTHO, LOCATION=ELEMENT, TABLE=DIST_TABLE_ORTHO
 EALL, 2.69230769E11,1.15384615E11,2.69230769E11,1.15384615E11,1.15384615E11,2.69230769E11,0.769230769E11
*MATERIAL,NAME=MAT1
*ELASTIC,TYPE=ORTHOTROPIC
 DISTORTHO
*PLASTIC
300.E8,0.0
350.E8,0.1
*STEP,NLGEOM
*STATIC
.1,1.
*BOUNDARY
XYPLANE,3,3
YZPLANE,1,1
XZPLANE,2,2
DISP,1,1,-0.2
DISP1,1,1,-0.1
*OUTPUT,FIELD,VARIABLE=PRESELECT
*ELEMENT OUTPUT
S,
EE,
PE,
*NODE OUTPUT
COORD
*END STEP
*STEP,NLGEOM
*STATIC
.1,1.
*BOUNDARY, OP=MOD
DISP1,1,1,-0.2
*END STEP