*HEADING
 Substructure generation file for sphericalcavinfmed_i2_sub.inp
**
*NODE,SYSTEM=S,NSET=IN
*NODE,SYSTEM=S,NSET=OUT
*NGEN,LINE=C,NSET=IN
*NGEN,LINE=C,NSET=OUT
*NFILL, BIAS=.5, TWO STEP
IN,OUT,4,100
*NSET,NSET=XSYM,GENERATE
*NSET,NSET=YSYM,GENERATE
*NSET,NSET=ZSYM,GENERATE
*NSET,NSET=OUTN,GENERATE
*NSET,NSET=NALL
IN,OUT,4,100
*ELEMENT,TYPE=C3D20R,ELSET=EALL
*ELEMENT,TYPE=CIN3D12R,ELSET=EALL
*ELGEN,ELSET=EALL
*ELGEN,ELSET=EALL
*ELSET,ELSET=INEL,GENERATE
*SOLID SECTION,ELSET=EALL,MATERIAL=ONE
*MATERIAL,NAME=ONE
*ELASTIC
1.E7,.33
**
**
*STEP
*SUBSTRUCTURE GENERATE,TYPE=Z1,OVERWRITE,SOLID INFINITE FORMULATION=STATIC
*RETAINED NODAL DOFS
*BOUNDARY
XSYM,1
YSYM,2
ZSYM,3
*SUBSTRUCTURE LOAD CASE,NAME=LOAD
*DLOAD
INEL,P1,750.
*END STEP