*HEADING
 SHALLOW CLAMPED ARCH LOADED WITH PUNCH, STABILIZED
*NODE
*NGEN,LINE=C
*NSET,NSET=NENDS
*ELEMENT,TYPE=B21
*ELGEN,ELSET=ARCH
*BEAM SECTION,SECTION=RECT,ELSET=ARCH,MATERIAL=A1
1.,2.
*MATERIAL,NAME=A1
*ELASTIC
1.E7,.25
*ELSET,ELSET=ET1
*ELSET,ELSET=ET2,GENERATE
*rigid body,analytical surface=BSURF,REF NODE=100
*surface,TYPE=SEGMENTS,NAME=BSURF
START, 5.,9.
CIRCL, 0.,4., 0.,9.
*surface,NAME=ASURF
ET1,SPOS
*CONTACT PAIR,INTERACTION=DAMP
ASURF,BSURF
*SURFACE INTERACTION,NAME=DAMP
1.,
*surface,NAME=CSURF
ET2,SPOS
*CONTACT PAIR,INTERACTION=DAMP
CSURF,BSURF
*BOUNDARY
1,1
1,6
11,PINNED
100,1
100,6
*RESTART,WRITE,FREQUENCY=1
*STEP,NLGEOM
LOADING
*STATIC, STABILIZE,allsdtol
.05,1.,,.05
*BOUNDARY,OP=MOD
100,2,2,-9.0
*PRINT,RESIDUAL=NO
*MONITOR, NODE=1, DOF=2
*CONTACT PRINT,SLAVE=ASURF,FREQUENCY=5
*CONTACT PRINT,SLAVE=CSURF,FREQUENCY=5
*CONTACT FILE,SLAVE=ASURF
*CONTACT FILE,SLAVE=CSURF
*EL PRINT,FREQUENCY=5
S,E,
ELSD
*NODE PRINT,SUMMARY=NO,FREQUENCY=5
U,RF
VF
*ENERGY PRINT,FREQUENCY=5
*NODE FILE,FREQUENCY=5
VF
*EL FILE,FREQUENCY=1000
ELEN,
*output, history
*energy output, var=all
*END STEP