*HEADING
 SHALLOW CLAMPED ARCH WITH DISPLACED MIDPOINT
*NODE
*NGEN,LINE=C
*ELEMENT,TYPE=B21
*ELGEN,ELSET=ARCH
*BEAM SECTION,SECTION=RECT,ELSET=ARCH,MATERIAL=A1
1.,2.
*MATERIAL,NAME=A1
*ELASTIC
1.E7,.25
*BOUNDARY
1,1
1,6
11,PINNED
*NSET,NSET=NENDS
*RESTART,WRITE,FREQUENCY=2
*STEP,NLGEOM
LOADING
*STATIC
.05,1., ,.05
*BOUNDARY,OP=MOD
1, 2,2, -9.0
*PRINT,RESIDUAL=NO
*MONITOR,NODE=1,DOF=2
*EL PRINT,FREQUENCY=0
*NODE PRINT,SUMMARY=NO,FREQUENCY=2
U,RF
*NODE FILE,NSET=NENDS
U,RF
*END STEP