** snaparrow_gc.inp
*Preprint, echo=NO, model=NO, history=NO, contact=NO
**
** PARTS
**
*Part, name=Clip
*Node
*Element, type=C3D8R
*Nset, nset=All, generate
*Elset, elset=All, generate
** Section: Plastic
*Solid Section, elset=All, controls=EC-1, material=Duracon
1.,
*End Part
**
*Part, name=Holder
*Node
*Element, type=C3D8R
*Nset, nset=All, generate
*Elset, elset=All, generate
** Section: Plastic
*Solid Section, elset=All, controls=EC-1, material=Duracon
1.,
*End Part
**
**
** ASSEMBLY
**
*Assembly, name=Assembly
**
*Instance, name=Clip-1, part=Clip
*End Instance
**
*Instance, name=Holder-1, part=Holder
*End Instance
**
*Nset, nset=Fix, instance=Holder-1
*Elset, elset=Fix, instance=Holder-1
*Nset, nset=Push, instance=Clip-1
*Nset, nset=refnode, instance=Clip-1
*Elset, elset=Push, instance=Clip-1
*Elset, elset=__Int-1_gcs0_80_S3, internal, instance=Holder-1
*Elset, elset=__Int-1_gcs0_80_S4, internal, instance=Holder-1
*Surface, type=ELEMENT, name=_Int-1_gcs0_80, internal
__Int-1_gcs0_80_S3, S3
__Int-1_gcs0_80_S4, S4
*Elset, elset=__Int-1_gcs0_81_S4, internal, instance=Holder-1
*Elset, elset=__Int-1_gcs0_81_S3, internal, instance=Holder-1, generate
*Elset, elset=__Int-1_gcs0_81_S2, internal, instance=Holder-1, generate
*Surface, type=ELEMENT, name=_Int-1_gcs0_81, internal
__Int-1_gcs0_81_S4, S4
__Int-1_gcs0_81_S3, S3
__Int-1_gcs0_81_S2, S2
*kinematic coupling,ref node=refnode
Push,1,3
*End Assembly
**
** ELEMENT CONTROLS
**
*Section Controls, name=EC-1, hourglass=ENHANCED
**
** MATERIALS
**
*Material, name=Duracon
*Elastic
1567., 0.45
**
** INTERACTION PROPERTIES
**
*Surface Interaction, name=IntProp-1
1.,
*Friction, slip tolerance=0.005
 0.1,
*Surface Behavior, penalty
**
** INTERACTIONS
**
** Interaction: Int-1
*Contact
*Contact Inclusions, ALL EXTERIOR
*Contact Property Assignment
 ,  , IntProp-1
*Surface Property Assignment, property=GEOMETRIC CORRECTION
_Int-1_gcs0_80, Circumferential, -2., -1.77636e-15, 4.25,  -1., -1.83828e-15, 4.25
_Int-1_gcs0_81, Circumferential, -2., -8.88178e-16, -4.25,  -1., -9.501e-16, -4.25
** ----------------------------------------------------------------
**
** STEP: Step-1
**
*Step, name=Step-1, nlgeom=YES, inc=10000, unsymm=YES
***Static, stabilize=0.000002, allsdtol=0.0, continue=NO
*Static
0.1, 1., 1e-05, 0.1
***contact controls, stabilize=1.e-4
**
** BOUNDARY CONDITIONS
**
** Name: Fix Type: Displacement/Rotation
*Boundary
Fix, 1, 1
Fix, 2, 2
Fix, 3, 3
** Name: push Type: Displacement/Rotation
*Boundary
refnode, 1, 1, 7.
refnode, 2, 6
**
** OUTPUT REQUESTS
**
*Restart, write, frequency=0
**
** FIELD OUTPUT: F-Output-2
**
*Output, field
*Contact Output
CFORCE, CSTRESSETOS
**
** FIELD OUTPUT: F-Output-1
**
*Output, field, variable=PRESELECT
**
** HISTORY OUTPUT: H-Output-1
**
*Output, history
*energy output
ETOTAL,ALLAE,ALLIE,ALLWK,ALLFD,
ALLCCE,ALLCCEN,ALLCCET,ALLCCDW
*node output,nset=refnode
rf1
*energy print
*End Step