*HEADING
SIMPLY SUPPORTED PLATE WITH UNIFORM PRESSURE---STRI65 14 X 14 MESH 40 DEG
*PREPRINT,ECHO=YES,HISTORY=NO,MODEL=NO
*NODE, NSET=CORNERS
*NGEN,NSET=BOT
*NGEN,NSET=TOP
*NFILL
BOT,TOP,28,100
*NSET,NSET=SIDES,GENERATE
*NSET,NSET=CENTND
*ELEMENT, TYPE=STRI65
*ELGEN,ELSET=ALLELS
*ELSET,ELSET=CENTER
*SHELL SECTION,MATERIAL=A1,ELSET=ALLELS
.01,3
*MATERIAL,NAME=A1
*ELASTIC
3.E7,  .3
*BOUNDARY
SIDES,1,3
*STEP
*STATIC
*DLOAD
ALLELS,P,-1.
*NODE PRINT, NSET=CENTND
U,
*EL PRINT, ELSET=CENTER, POSITION=AVERAGED AT NODES
SF,
*NODE FILE, NSET=CENTND
U,
*OUTPUT,FIELD
*NODE OUTPUT,NSET=CENTND
U,
*EL FILE, ELSET=CENTER, POSITION=AVERAGED AT NODES
SF,
*END STEP