*HEADING
SIMPLY SUPPORTED SQUARE PLATE WITH UNIFORM PRESSURE--SC6R 14x14 MESH 30 DEG
*PREPRINT,ECHO=YES,HISTORY=NO,MODEL=NO
*NODE, NSET=CORNERS
*NGEN,NSET=BOT
*NGEN,NSET=TOP
*NFILL
BOT,TOP,14,100
*NSET,NSET=SIDES_BOT,GENERATE
*NSET,NSET=SIDES_TOP,GENERATE
*NSET,NSET=LFTRT,GENERATE
*NSET,NSET=TOPBOT,GENERATE
*NSET,NSET=CENTND
*ELEMENT, TYPE=SC6R
*ELGEN,ELSET=ALLELS
*ELSET,ELSET=CENTER
*SHELL SECTION,MATERIAL=A1,ELSET=ALLELS, POISSON=ELASTIC
.01,3
*MATERIAL,NAME=A1
*ELASTIC
3.E7,  .3
***BOUNDARY
**SIDES,1,3
*EQUATION
SIDES_BOT,1,1.0,SIDES_TOP,1,1.0
SIDES_BOT,2,1.0,SIDES_TOP,2,1.0
SIDES_BOT,3,1.0,SIDES_TOP,3,1.0
*STEP
*STATIC
*DLOAD
ALLELS,P1,-1.
*NODE PRINT, NSET=CENTND
U,
*EL PRINT, ELSET=CENTER, POSITION=AVERAGED AT NODES
SF,
*NODE FILE, NSET=CENTND
U,
*OUTPUT,FIELD
*NODE OUTPUT
U,
*EL FILE, ELSET=CENTER, POSITION=AVERAGED AT NODES
SF,
*END STEP