*HEADING
SIMPLY SUPPORTED SQUARE PLATE WITH UNIFORM PRESSURE--SC8R 8 X 8 MESH 60 DEG
*PREPRINT,ECHO=YES,MODEL=NO,HISTORY=NO
*NODE, NSET=CORNERS
*NGEN,NSET=BOT
*NGEN,NSET=TOP
*NFILL
BOT,TOP,8,100
*NSET,NSET=SIDES_BOT,GENERATE
*NSET,NSET=SIDES_TOP,GENERATE
*NSET,NSET=CENTND
*ELEMENT, TYPE=SC8R
*ELGEN,ELSET=ALLELS
*ELSET,ELSET=CENTER
*SHELL SECTION,MATERIAL=A1,ELSET=ALLELS
.01,3
*MATERIAL,NAME=A1
*ELASTIC
3.E7,  .3
*DENSITY
3.0E3,
***BOUNDARY
**SIDES,1,3
*EQUATION
SIDES_BOT, 1, 1.0, SIDES_TOP, 1, 1.0
SIDES_BOT, 2, 1.0, SIDES_TOP, 2, 1.0
SIDES_BOT, 3, 1.0, SIDES_TOP, 3, 1.0
*STEP
*DYNAMIC, EXPLICIT
 ,7.0
*AMPLITUDE, NAME=DAMPLATER
0., 0., 5., 0., 5.01, 1.0, 100., 1.0
*AMPLITUDE ,NAME=SMOOTH, DEF=SMOOTH STEP
0., 0., 5., 1., 100., 1.
*DLOAD,AMP=DAMPLATER
ALLELS,VP1,3400.0
*DLOAD,AMP=SMOOTH
ALLELS,P1,-1.
***OUTPUT,HISTORY,TIME INTERVAL=.015
***ELEMENT OUTPUT,ELSET=CENTER
**SF,
***NODE OUTPUT,NSET=CENTND
**U,
***ENERGY OUTPUT
**ALLKE,ALLIE,ALLSE,ALLAE,ALLVD,ALLCD,ALLPD,ALLFD,ALLWK,ETOTAL,DT
*OUTPUT,FIELD,VAR=PRESELECT,NUMBER INTERVAL=5
**
** Output requests for qa testing
**
*NSET,NSET=QA_TEST
CENTND,
*FILE OUTPUT,NUMBER INTERVAL=1
*NODE FILE,NSET=CENTND
U,
*OUTPUT, FIELD, NUMBER INTERVAL=1
*NODE OUTPUT, NSET=QA_TEST
U,
*OUTPUT, HISTORY, VAR=PRESELECT, TIME INTERVAL=1.
*NODE OUTPUT, NSET=QA_TEST
U,
*END STEP