*HEADING
 SHALLOW CYLINDRICAL SHELL VIA S3R
 WITH GAUSS INTEGRATION WITH 3 SECTION POINTS
*restart,w
*PREPRINT,ECHO=YES,HISTORY=NO,MODEL=NO
*NODE
*NGEN,LINE=C,NSET=EDGE
*NGEN,LINE=C,NSET=ZSYMM
*NGEN,NSET=YSYMM
*NGEN,NSET=HINGE
*NFILL
EDGE,ZSYMM,8,9
*NSET,NSET=N73
*ELEMENT,TYPE=S3R
*ELGEN,ELSET=EALL
*SHELL SECTION,MATERIAL=A1,ELSET=EALL, SECTION=GAUSS
6.35E-3,3
*MATERIAL,NAME=A1
*ELASTIC
3.103E9,0.3
*BOUNDARY
ZSYMM,ZSYMM
YSYMM,YSYMM
HINGE,1,5
*STEP,NLGEOM,INC=50
*STATIC,RIKS
0.025,1.,0.,0.04,0.06
*NODE PRINT,FREQUENCY=2
U,
RF,
*CLOAD
73,1,-3000.0
*MONITOR,NODE=73,DOF=1
*EL PRINT,FREQUENCY=2
SF,
SSAVG,
*NODE FILE,NSET=N73
U,CF
*OUTPUT,FIELD
*NODE OUTPUT,NSET=N73
U,CF
*END STEP