*HEADING
Thick plate rolling: 3-Dimensional, ABAQUS/Explicit
*RESTART,WRITE,NUM=4
*NODE
** Bar
*NGEN,NSET=BOT1
*NGEN,NSET=TOP1
*NGEN,NSET=BOT2
*NGEN,NSET=TOP2
*NFILL,NSET=ZSYMM
BOT1,TOP1,8,100
*NFILL,NSET=SIDE
BOT2,TOP2,8,100
*NFILL,NSET=BAR
ZSYMM,SIDE,8,3000
*NSET,NSET=BOTTOM,GEN
**
***** Bar
**
*ELEMENT,TYPE=C3D8R,ELSET=METAL
*ELGEN,ELSET=METAL
**
*ELSET,ELSET=TOP,GEN
*ELSET,ELSET=BACK,GEN
*ELSET,ELSET=SIDE,GEN
**
*SOLID SECTION,ELSET=METAL,MAT=C15
1.,
**
*MATERIAL,NAME=C15
*ELASTIC
1.5E11,.3
*PLASTIC
168.72E06,0
219.33E06,0.1
272.02E06,0.2
308.53E06,0.3
337.37E06,0.4
361.58E06,0.5
382.65E06,0.6
401.42E06,0.7
*DENSITY
7.85E3,
**
*NODE
** Reference node
*INITIAL CONDITIONS,TYPE=VELOCITY
BAR,1,1.0367
**
***************** Step 1
*SURFACE, NAME=ROLLER, TYPE=REVOL
START, 0.170,0.03
LINE,  0.170,0.0
*SURFACE,TYPE=ELEMENT, NAME=SURF1
TOP,S2
SIDE,S5
*RIGID BODY, REF NODE=30000, ANALYTICAL SURFACE =ROLLER
*STEP
*DYNAMIC,EXPLICIT
,0.089286
*FIXED MASS SCALING,FACTOR=2758.5,ELSET=METAL
** Roller, Radius = .170 m
*BOUNDARY
BOTTOM,2,2
ZSYMM,ZSYMM
30000,1,5
**
*BOUNDARY,TYPE=VELOCITY
**30000,6,6,330.0
30000,6,6,6.2832
**
*SURFACE INTERACTION,NAME=FRICT
*FRICTION
 0.3,
*CONTACT PAIR,INTERACTION=FRICT
SURF1,ROLLER
**
*OUTPUT,FIELD,OP=NEW,NUMBER INTERVAL=4,TIMEMARKS=NO
*ELEMENT OUTPUT
 S, PEEQ
*NODE OUTPUT
 U,
*OUTPUT,HISTORY,OP=NEW,TIME INTERVAL=1.785E-4
*ENERGY OUTPUT
 ALLAE,ALLIE,ALLKE,ALLPD,ALLSE,ALLVD,ALLWK,ETOTAL
**
*FILE OUTPUT,TIMEMARKS=YES,NUM=1
*EL FILE, ELSET=QA_TEST
PEEQ,
*NODE FILE, NSET=QA_TEST
U,
*ENERGY FILE
*****
*ELSET, ELSET=QA_TEST
SIDE,
*NSET, NSET=QA_TEST
SIDE,
*OUTPUT, FIELD, TIME MARKS=YES, NUMBER INTERVAL=1
*ELEMENT OUTPUT, ELSET=QA_TEST
PEEQ,
*NODE OUTPUT, NSET=QA_TEST
U,
****
*END STEP